{"text_format":"1","workbook":"xlsx","n_sheets":9,"sheets":["Ilmanvaihto","PILP-laskin","Kuva 1","Kuva 2","Kuva 3a","Kuva 3b","Kuva 4","Kuva 5","Hki-2012"],"not_rendered":{"charts":12,"images":0,"macros":1,"external_links":0,"defined_names":6,"comments":3,"pivot_tables":0},"unopened":[{"sheet":"Kuva 1","index":2,"reason":"not_a_worksheet"},{"sheet":"Kuva 2","index":3,"reason":"not_a_worksheet"},{"sheet":"Kuva 3a","index":4,"reason":"not_a_worksheet"},{"sheet":"Kuva 3b","index":5,"reason":"not_a_worksheet"},{"sheet":"Kuva 4","index":6,"reason":"not_a_worksheet"},{"sheet":"Kuva 5","index":7,"reason":"not_a_worksheet"}],"bounds":{"document_bytes":16777216,"sheet_cells":100000,"rows_first":2000,"rows_last":500,"rows_between":2000,"halvings":0,"cell_chars":16384,"cell_head_chars":4096},"cells_cut":0,"cells_raw":0,"read":"whole","date_system":"1900"}

{"sheet":"Ilmanvaihto","index":0,"n_rows":122,"n_cols":16,"rows_kept":122,"cut":false,"hidden":false,"merged":[[45,0,45,1],[45,7,45,8],[0,7,0,11],[1,7,1,11],[2,7,2,11],[3,7,3,11],[4,7,4,11],[5,7,5,11],[7,11,8,11],[11,0,11,1],[11,7,11,8],[12,0,12,1],[41,10,42,10],[103,0,103,1],[103,7,103,8],[104,0,104,1],[46,0,46,1],[65,11,66,11],[69,0,69,1],[69,7,69,8],[70,0,70,1],[99,10,100,10]]}
["Aputaulukot, joilla voidaan laskea lämpöhäviöiden tasauslaskennassa tarvittavat",null,null,null,null,null,"Rakennuskohde","RET-pientalo"]
["keskimääräiset poistoilmavirrat ja ilmanvaihdon lämmöntalteenoton (LTO) vuosihyötysuhteet, ",null,null,null,null,null,"Rakennuslupatunnus","Esimerkki"]
["kun rakennuksessa on useita ilmanvaihtokoneita ja niillä erilaisia käyttöaikoja.",null,null,null,null,null,"Rakennustyyppi","1-kerroksinen pientalo, ikkunapinta-ala 15 % kerrostasoalasta."]
[null,null,null,null,null,null,"Pääsuunnittelija","Nibbe Niilanen"]
[null,null,null,null,null,null,"Laskelman tekijä","Lemmi Pumppu"]
["Taulukko 1. Poistoilman lämmöntalteenottovaatimuksen piiriin kuuluvat lämpimien tilojen ilmanvaihtokoneet ",null,null,null,null,null,"Päiväys","2017-03-31"]
["Taulukko 2. Poistoilman lämmöntalteenottovaatimuksen piiriin kuulumattomat lämpimien tilojen ilmanvaihtokoneet"]
["Taulukko 3. Poistoilman lämmöntalteenottovaatimuksen piiriin kuuluvat puolilämpimien tilojen ilmanvaihtokoneet",null,null,null,null,null,null,null,null,null,null,"TASAUSLASKENTA-LOMAKKEESEEN"]
["Taulukko 4. Poistoilman lämmöntalteenottovaatimuksen piiriin kuulumattomat puolilämpimien tilojen ilmanvaihtokoneet"]
[null,null,null,null,null,null,null,null,null,null,"Poistoilmavirta, m³ \n[qv, p]","Ilmanvaihdon LTO:n vuosihyötysuhde, %  [ηa]","Ilmanvaihtojärjestelmän ominaissähköteho, kW/(m³/s)","Ilmanvaihtojärjestelmän sähkönkulutus, \nkWh/a"]
["Taulukko 1. Lämpimät tilat",null,null,null,null,null,null,null,null,null,{"$f":"SUM(K15:K39)","v":7.4833333333333335E-2},{"$f":"P13/(K11+1E-50)","v":0.67015590200445418},{"$f":"N11/8760/(K11+1E-50)","v":1.7884187082405345},{"$f":"SUM(N15:N39)","v":1172.3799999999999}]
["Poistoilman lämmöntalteenottovaatimuksen",null,"Käyttötapa","Mitoitus-","Mitoitus-","Käyttö-","Käyttöajan","Käyntiaikatekijät",null,null,"Käyntiajoilla","Ilmanvaihtokoneen","Ilmanvaihtokoneen","Ilmanvaihtokoneen",null,"Apusarake"]
["piiriin kuuluvat ilmanvaihtokoneet",null,null,"ulkoilmavirta","poistoilmavirta","iImavirta-","keskimääräinen","td","tw",null,"painotettu","LTO:n vuosihyötysuhde,","ominaissähköteho","sähkönkulutus,",null,{"$f":"SUM(P15:P39)","v":5.0149999999999993E-2}]
["Kone","Palvelualue",null,"m³/s","m³/s","kerroin","poistoilmavirta, m³/s","h/vrk","vrk/vko",null,"poistoilmavirta, m³/s","% [ηa, ivkone]","kW/(m³/s)","kWh/a"]
["PILP","Koko rakennus","Jatk.käyttö",5.2999999999999999E-2,5.8999999999999997E-2,1,{"$f":"F15*E15","v":5.8999999999999997E-2},24,7,1,{"$f":"G15*H15/24*I15/7*J15","v":5.8999999999999997E-2},0.85,2,{"$f":"(D15>E15)*(D15/(E15+1E-50)*M15*K15*8760)+(D15<=E15)*(M15*K15*8760)","v":1033.6799999999998},null,{"$f":"K15*L15","v":5.0149999999999993E-2}]
["Huippuimuri","Keittiön liesikupu","Tehostus",null,0.08,1,{"$f":"F16*E16","v":0.08},2,7,1,{"$f":"G16*H16/24*I16/7*J16","v":6.6666666666666671E-3},0,1,{"$f":"(D16>E16)*(D16/(E16+1E-50)*M16*K16*8760)+(D16<=E16)*(M16*K16*8760)","v":58.400000000000006},null,{"$f":"K16*L16","v":0}]
["- \" -","- \" -","Muulloin",null,0.01,1,{"$f":"F17*E17","v":0.01},22,7,1,9.1666666666666667E-3,0,1,80.3,null,0]
[null,null,null,null,null,null,0,null,null,1,0,null,null,0,null,0]
[null,null,null,null,null,null,0,null,null,1,0,null,null,0,null,0]
[null,null,null,null,null,null,0,null,null,1,0,null,null,0,null,0]
[null,null,null,null,null,null,0,null,null,1,0,null,null,0,null,0]
[null,null,null,null,null,null,0,null,null,1,0,null,null,0,null,0]
[null,null,null,null,null,null,0,null,null,1,0,null,null,0,null,0]
[null,null,null,null,null,null,0,null,null,1,0,null,null,0,null,0]
[null,null,null,null,null,null,0,null,null,1,0,null,null,0,null,0]
[null,null,null,null,null,null,0,null,null,1,0,null,null,0,null,0]
[null,null,null,null,null,null,0,null,null,1,0,null,null,0,null,0]
[null,null,null,null,null,null,0,null,null,1,0,null,null,0,null,0]
[null,null,null,null,null,null,0,null,null,1,0,null,null,0,null,0]
[null,null,null,null,null,null,0,null,null,1,0,null,null,0,null,0]
[null,null,null,null,null,null,0,null,null,1,0,null,null,0,null,0]
[null,null,null,null,null,null,0,null,null,1,0,null,null,0,null,0]
[null,null,null,null,null,null,0,null,null,1,0,null,null,0,null,0]
[null,null,null,null,null,null,0,null,null,1,0,null,null,0,null,0]
[null,null,null,null,null,null,0,null,null,1,0,null,null,0,null,0]
[null,null,null,null,null,null,0,null,null,1,0,null,null,0,null,0]
[null,null,null,null,null,null,0,null,null,1,0,null,null,0,null,0]
[null,null,null,null,null,null,0,null,null,1,0,null,null,0,null,0]
[null,null,null,null,null,null,0,null,null,1,0,null,null,0,null,0]
["© Ympäristöministeriö, PILP-laskin 2018 (versio maaliskuu 2017)"]
[]
[null,null,null,null,null,null,null,null,null,null,"TASAUSLASKENTA-LOMAKKEESEEN"]
[]
[null,null,null,null,null,null,null,null,null,null,"Poistoilmavirta, m³ \n[qv, p]",null,"Ilmanvaihtojärjestelmän ominaissähköteho, kW/(m³/s)","Ilmanvaihtojärjestelmän sähkönkulutus, \nkWh/a"]
["Taulukko 2. Lämpimät tilat",null,null,null,null,null,null,null,null,null,{"$f":"SUM(K49:K63)","v":0},null,{"$f":"N45/8760/(K45+1E-50)","v":0},{"$f":"SUM(N49:N63)","v":0}]
["Poistoilman lämmöntalteenottovaatimuksen",null,"Käyttötapa","Mitoitus-","Mitoitus-","Käyttö-","Käyttöajan","Käyntiaikatekijät",null,null,"Käyntiajoilla",null,"Ilmanvaihtokoneen","Ilmanvaihtokoneen"]
["piiriin kuulumattomat ilmanvaihtokoneet",null,null,"ulkoilmavirta","poistoilmavirta","iImavirta-","keskimääräinen","td","tw",null,"painotettu",null,"ominaissähköteho","sähkönkulutus,"]
["Kone","Palvelualue",null,"m³/s","m³/s","kerroin","poistoilmavirta, m³/s","h/vrk","vrk/vko",null,"poistoilmavirta, m³/s",null,"kW/(m³/s)","kWh/a"]
[null,null,null,null,null,null,{"$f":"F49*E49","v":0},null,null,1,{"$f":"G49*H49/24*I49/7*J49","v":0},null,null,{"$f":"M49*K49*8760","v":0}]
[null,null,null,null,null,null,{"$f":"F50*E50","v":0},null,null,1,{"$f":"G50*H50/24*I50/7*J50","v":0},null,null,{"$f":"M50*K50*8760","v":0}]
[null,null,null,null,null,null,{"$f":"F51*E51","v":0},null,null,1,{"$f":"G51*H51/24*I51/7*J51","v":0},null,null,0]
[null,null,null,null,null,null,{"$f":"F52*E52","v":0},null,null,1,{"$f":"G52*H52/24*I52/7*J52","v":0},null,null,0]
[null,null,null,null,null,null,{"$f":"F53*E53","v":0},null,null,1,{"$f":"G53*H53/24*I53/7*J53","v":0},null,null,0]
[null,null,null,null,null,null,{"$f":"F54*E54","v":0},null,null,1,{"$f":"G54*H54/24*I54/7*J54","v":0},null,null,0]
[null,null,null,null,null,null,0,null,null,1,0,null,null,0]
[null,null,null,null,null,null,0,null,null,1,0,null,null,0]
[null,null,null,null,null,null,0,null,null,1,0,null,null,0]
[null,null,null,null,null,null,0,null,null,1,0,null,null,0]
[null,null,null,null,null,null,0,null,null,1,0,null,null,0]
[null,null,null,null,null,null,0,null,null,1,0,null,null,0]
[null,null,null,null,null,null,0,null,null,1,0,null,null,0]
[null,null,null,null,null,null,0,null,null,1,0,null,null,0]
[null,null,null,null,null,null,0,null,null,1,0,null,null,0]
[{"$f":"A$40","v":"© Ympäristöministeriö, PILP-laskin 2018 (versio maaliskuu 2017)"}]
[]
[null,null,null,null,null,null,null,null,null,null,null,"TASAUSLASKENTA-LOMAKKEESEEN"]
[]
[null,null,null,null,null,null,null,null,null,null,"Poistoilmavirta, m³ \n[qv, p]","Ilmanvaihdon LTO:n vuosihyötysuhde, %  [ηa]","Ilmanvaihtojärjestelmän ominaissähköteho, kW/(m³/s)","Ilmanvaihtojärjestelmän sähkönkulutus, \nkWh/a"]
["Taulukko 3. Puolilämpimät tilat",null,null,null,null,null,null,null,null,null,{"$f":"SUM(K73:K97)","v":0},{"$f":"P71/(K69+1E-50)","v":0},{"$f":"N69/8760/(K69+1E-50)","v":0},{"$f":"SUM(N73:N97)","v":0}]
["Poistoilman lämmöntalteenottovaatimuksen",null,"Käyttötapa","Mitoitus-","Mitoitus-","Käyttö-","Käyttöajan","Käyntiaikatekijät",null,null,"Käyntiajoilla","Ilmanvaihtokoneen","Ilmanvaihtokoneen","Ilmanvaihtokoneen",null,"Apusarake"]
["piiriin kuuluvat ilmanvaihtokoneet",null,null,"ulkoilmavirta","poistoilmavirta","iImavirta-","keskimääräinen","td","tw",null,"painotettu","LTO:n vuosihyötysuhde,","ominaissähköteho","sähkönkulutus,",null,{"$f":"SUM(P73:P97)","v":0}]
["Kone","Palvelualue",null,"m³/s","m³/s","kerroin","poistoilmavirta, m³/s","h/vrk","vrk/vko",null,"poistoilmavirta, m³/s","% [ηa, ivkone]","kW/(m³/s)","kWh/a"]
[null,null,null,null,null,null,{"$f":"F73*E73","v":0},null,null,1,{"$f":"G73*H73/24*I73/7*J73","v":0},null,null,{"$f":"M73*K73*8760","v":0},null,{"$f":"K73*L73","v":0}]
[null,null,null,null,null,null,{"$f":"F74*E74","v":0},null,null,1,{"$f":"G74*H74/24*I74/7*J74","v":0},null,null,{"$f":"M74*K74*8760","v":0},null,0]
[null,null,null,null,null,null,0,null,null,1,0,null,null,{"$f":"M75*K75*8760","v":0},null,0]
[null,null,null,null,null,null,0,null,null,1,0,null,null,{"$f":"M76*K76*8760","v":0},null,0]
[null,null,null,null,null,null,0,null,null,1,0,null,null,0,null,0]
[null,null,null,null,null,null,0,null,null,1,0,null,null,0,null,0]
[null,null,null,null,null,null,0,null,null,1,0,null,null,0,null,0]
[null,null,null,null,null,null,0,null,null,1,0,null,null,0,null,0]
[null,null,null,null,null,null,0,null,null,1,0,null,null,0,null,0]
[null,null,null,null,null,null,0,null,null,1,0,null,null,0,null,0]
[null,null,null,null,null,null,0,null,null,1,0,null,null,0,null,0]
[null,null,null,null,null,null,0,null,null,1,0,null,null,0,null,0]
[null,null,null,null,null,null,0,null,null,1,0,null,null,0,null,0]
[null,null,null,null,null,null,0,null,null,1,0,null,null,0,null,0]
[null,null,null,null,null,null,0,null,null,1,0,null,null,0,null,0]
[null,null,null,null,null,null,0,null,null,1,0,null,null,0,null,0]
[null,null,null,null,null,null,0,null,null,1,0,null,null,0,null,0]
[null,null,null,null,null,null,0,null,null,1,0,null,null,0,null,0]
[null,null,null,null,null,null,0,null,null,1,0,null,null,0,null,0]
[null,null,null,null,null,null,0,null,null,1,0,null,null,0,null,0]
[null,null,null,null,null,null,0,null,null,1,0,null,null,0,null,0]
[null,null,null,null,null,null,0,null,null,1,0,null,null,0,null,0]
[null,null,null,null,null,null,0,null,null,1,0,null,null,0,null,0]
[null,null,null,null,null,null,0,null,null,1,0,null,null,0,null,0]
[null,null,null,null,null,null,0,null,null,1,0,null,null,0,null,0]
[{"$f":"A$40","v":"© Ympäristöministeriö, PILP-laskin 2018 (versio maaliskuu 2017)"}]
[]
[null,null,null,null,null,null,null,null,null,null,"TASAUSLASKENTA-LOMAKKEESEEN"]
[]
[null,null,null,null,null,null,null,null,null,null,"Poistoilmavirta, m³ \n[qv, p]",null,"Ilmanvaihtojärjestelmän ominaissähköteho, kW/(m³/s)","Ilmanvaihtojärjestelmän sähkönkulutus, \nkWh/a"]
["Taulukko 4. Puolilämpimät tilat",null,null,null,null,null,null,null,null,null,null,null,{"$f":"N103/8760/(K103+1E-50)","v":0},{"$f":"SUM(N107:N121)","v":0}]
["Poistoilman lämmöntalteenottovaatimuksen",null,"Käyttötapa","Mitoitus-","Mitoitus-","Käyttö-","Käyttöajan","Käyntiaikatekijät",null,null,"Käyntiajoilla",null,"Ilmanvaihtokoneen","Ilmanvaihtokoneen"]
["piiriin kuulumattomat ilmanvaihtokoneet",null,null,"ulkoilmavirta","poistoilmavirta","iImavirta-","keskimääräinen","td","tw",null,"painotettu",null,"ominaissähköteho","sähkönkulutus,"]
["Kone","Palvelualue",null,"m³/s","m³/s","kerroin","poistoilmavirta, m³/s","h/vrk","vrk/vko",null,"poistoilmavirta, m³/s",null,"kW/(m³/s)","kWh/a"]
[null,null,null,null,null,null,{"$f":"F107*E107","v":0},null,null,1,{"$f":"G107*H107/24*I107/7*J107","v":0},null,null,{"$f":"M107*K107*8760","v":0}]
[null,null,null,null,null,null,{"$f":"F108*E108","v":0},null,null,1,{"$f":"G108*H108/24*I108/7*J108","v":0},null,null,{"$f":"M108*K108*8760","v":0}]
[null,null,null,null,null,null,{"$f":"F109*E109","v":0},null,null,1,{"$f":"G109*H109/24*I109/7*J109","v":0},null,null,0]
[null,null,null,null,null,null,{"$f":"F110*E110","v":0},null,null,1,{"$f":"G110*H110/24*I110/7*J110","v":0},null,null,0]
[null,null,null,null,null,null,{"$f":"F111*E111","v":0},null,null,1,{"$f":"G111*H111/24*I111/7*J111","v":0},null,null,0]
[null,null,null,null,null,null,{"$f":"F112*E112","v":0},null,null,1,{"$f":"G112*H112/24*I112/7*J112","v":0},null,null,0]
[null,null,null,null,null,null,0,null,null,1,0,null,null,0]
[null,null,null,null,null,null,0,null,null,1,0,null,null,0]
[null,null,null,null,null,null,0,null,null,1,0,null,null,0]
[null,null,null,null,null,null,0,null,null,1,0,null,null,0]
[null,null,null,null,null,null,0,null,null,1,0,null,null,0]
[null,null,null,null,null,null,0,null,null,1,0,null,null,0]
[null,null,null,null,null,null,0,null,null,1,0,null,null,0]
[null,null,null,null,null,null,0,null,null,1,0,null,null,0]
[null,null,null,null,null,null,0,null,null,1,0,null,null,0]
[{"$f":"A$40","v":"© Ympäristöministeriö, PILP-laskin 2018 (versio maaliskuu 2017)"}]

{"sheet":"PILP-laskin","index":1,"n_rows":69,"n_cols":40,"rows_kept":69,"cut":false,"hidden":false,"merged":[[2,35,3,35],[6,37,7,37],[6,31,7,31],[2,31,3,31],[0,1,0,4],[1,1,1,4],[2,1,2,4],[3,1,3,4],[4,1,4,4],[5,1,5,4]]}
["Rakennuskohde",{"$f":"IF(Ilmanvaihto!H1=0,\"\",Ilmanvaihto!H1)","v":"RET-pientalo"},null,null,null,null,null,null,null,null,null,null,null,null,null,null,null,null,null,null,null,null,null,null,null,null,null,24,{"$f":"C1","v":0}]
["Rakennuslupatunnus",{"$f":"IF(Ilmanvaihto!H2=0,\"\",Ilmanvaihto!H2)","v":"Esimerkki"},null,null,null,null,null,null,null,null,null,null,null,null,null,null,null,null,null,null,null,null,null,null,null,null,null,null,null,{"$f":"INDIRECT(\"i\"&$AB$1)","v":0.60000000000000009},null,{"$f":"INDIRECT(\"k\"&$AB$1)","v":0},null,"nt",null,{"$f":"INDIRECT(\"U\"&$AB$1)","v":0},null,{"$f":"INDIRECT(\"S\"&$AB$1)","v":0}]
["Rakennustyyppi",{"$f":"IF(Ilmanvaihto!H3=0,\"\",Ilmanvaihto!H3)","v":"1-kerroksinen pientalo, ikkunapinta-ala 15 % kerrostasoalasta."},null,null,null,null,null,null,null,null,null,null,null,null,null,null,null,null,null,null,null,null,null,null,null,null,null,null,{"$f":"INDIRECT(\"A\"&$AB$1)","v":0},null,{"$f":"INDIRECT(\"j\"&$AB$1)","v":0},"+",{"$f":"INDIRECT(\"L\"&$AB$1)","v":0},{"$f":"INDIRECT(\"H\"&$AB$1)","v":0},{"$f":"INDIRECT(\"V\"&$AB$1)","v":0},"-",{"$f":"INDIRECT(\"T\"&$AB$1)","v":0},null,{"$f":"INDIRECT(\"R\"&$AB$1)","v":0}]
["Pääsuunnittelija",{"$f":"IF(Ilmanvaihto!H4=0,\"\",Ilmanvaihto!H4)","v":"Nibbe Niilanen"},null,null,null,null,null,null,null,null,null,null,null,null,null,null,null,null,null,null,null,null,null,null,null,null,null,null,{"$f":"INDIRECT(\"E\"&$AB$1)","v":0},null,null,null,null,{"$f":"INDIRECT(\"ac\"&$AB$1)","v":0},null,null,null,null,{"$f":"INDIRECT(\"F\"&$AB$1)","v":0},"R"]
["Laskelman tekijä",{"$f":"IF(Ilmanvaihto!H5=0,\"\",Ilmanvaihto!H5)","v":"Lemmi Pumppu"},null,null,null,null,null,null,null,null,null,null,null,null,null,null,null,null,null,null,null,null,null,null,null,null,null,null,null,null,null,null,null,null,null,null,null,null,null,{"$f":"AM8/AM4","v":{"$error":"#DIV/0!"}}]
["Päiväys",{"$f":"IF(Ilmanvaihto!H6=0,\"\",Ilmanvaihto!H6)","v":"2017-03-31"},null,null,null,null,null,null,null,null,null,null,null,null,null,null,null,null,null,null,null,null,null,null,null,null,null,null,null,{"$f":"INDIRECT(\"X\"&$AB$1)","v":0},null,{"$f":"INDIRECT(\"U\"&$AB$1)","v":0},null,null,null,{"$f":"INDIRECT(\"N\"&$AB$1)","v":0},null,{"$f":"INDIRECT(\"P\"&$AB$1)","v":0}]
[null,null,null,null,null,null,null,null,null,null,null,null,null,null,null,null,null,null,null,null,null,null,null,null,null,null,null,null,{"$f":"INDIRECT(\"F\"&$AB$1)","v":0},null,null,"-",null,"LTO",null,null,{"$f":"INDIRECT(\"O\"&$AB$1)","v":0},"+",{"$f":"INDIRECT(\"Q\"&$AB$1)","v":0}]
[null,"Laskentataulukko, jolla voidaan laskea lämpöhäviöiden tasauslaskentaa varten",null,null,null,null,null,null,null,null,null,null,null,null,null,null,null,null,null,null,null,null,null,null,null,null,null,null,{"$f":"INDIRECT(\"Y\"&$AB$1)","v":0},null,null,null,{"$f":"INDIRECT(\"W\"&$AB$1)","v":0},{"$f":"(AI3-AG8)/(AI3-AG3)","v":{"$error":"#DIV/0!"}},{"$f":"INDIRECT(\"M\"&$AB$1)","v":0},null,null,null,{"$f":"INDIRECT(\"E\"&$AB$1)","v":0}]
[null,"poistoilmalämpöpumpun lämmöntalteenoton vuosihyötysuhde (ηa, PILP).",null,null,null,null,null,null,null,null,null,null,null,null,null,null,null,null,null,null,null,null,null,null,null,null,null,null,null,null,null,null,null,"np"]
[null,"Tällä voidaan laskea myös PILP:n ja LTO-lämmönsiirtimen yhdistelmä ja ",null,null,null,null,null,null,null,null,null,null,null,null,null,null,null,null,null,null,null,null,null,null,null,null,null,24,null,null,null,null,null,{"$f":"INDIRECT(\"AY\"&$AB$1)","v":0},null,null,null,null,{"$f":"INDIRECT(\"A\"&$AB$1)","v":0}]
[null,"pelkkä LTO-lämmönsiirrinratkaisu.",null,null,null,null,null,null,null,null,null,null,null,null,null,null,null,null,null,null,null,null,null,null,null,null,null,57,null,null,null,null,null,"na",null,null,null,null,{"$f":"AM4-AM8","v":0}]
[null,null,null,"Ulkoilmavirta","Poistoilmavirta"]
["Kone","Palvelualue","Käyttötapa","m³/s","m³/s"]
["PILP","Koko rakennus","jatkuva käyttö",5.2999999999999999E-2,5.8999999999999997E-2]
[]
[null,"Rakennuksen tiedot",null,null,null,null,null,null,"Oletusarvot"]
[null,"Rakennuksen käyttötarkoitusluokka (1 - 9)",1]
[null,"Lämmitetty nettoala",147,"m²"]
[null,"Ilmanvaihdon käyttöaika vuorokaudessa",24,"h/vrk",null,null,null,null,{"$f":"CHOOSE($C$17,24,24,13,15,24,10,16,24,24)","v":24}]
[null,"Ilmanvaihdon käyttöaika viikossa",7,"vrk/viikko",null,null,null,null,{"$f":"CHOOSE($C$17,7,7,5,6,7,5,7,7,7)","v":7}]
[null,"Rakennuksen vaipan ja vuotoilman ominaislämpöhäviö",88.2,"W/K",null,null,null,null,{"$f":"0.6*C18","v":88.2}]
[null,"Rakennuksen muu vakiolämmitystarve",0,"W",null,null,null,null,0]
[null,"Sisäiset lämpökuormat käyttöaikana"]
[null,"Lämpökuorma valaistuksesta",0.60000000000000009,"W/m²",null,null,null,null,{"$f":"CHOOSE($C$17,0.1*6,0.1*9,0.65*10,19,0.3*11,0.6*14,0.5*10,0.6*7,0.1*9)","v":0.60000000000000009}]
[null,"Lämpökuorma kuluttajalaitteista",1.7999999999999998,"W/m²",null,null,null,null,{"$f":"CHOOSE($C$17,0.6*3,0.6*4,0.65*12,1,0.3*4,0.6*8,0.5*0,0.6*9,0.6*4)","v":1.7999999999999998}]
[null,"Lämpökuorma ihmisistä",1.2,"W/m²",null,null,null,null,{"$f":"CHOOSE($C$17,0.6*2,0.6*3,0.65*5,2,0.3*4,0.6*14,0.5*5,0.6*8,0.6*3)","v":1.2}]
[null,"Sisäiset lämpökuormat yhteensä",{"$f":"(C24+C25+C26)*C18","v":529.19999999999993},"W"]
[null,"Auringon lämpökuorma"]
[null,"Ikkunoiden tiedot ilmansuunnittain","Pinta-ala, m²","g-arvo","Fläpäisy",null,null,null,null,"g-arvo","Fläpäisy"]
[null,"Pohjoinen",5,0.5,0.72,null,null,null,{"$f":"INT(0.2*0.15*$C$18/0.9+0.5)","v":5},0.5,0.72]
[null,"Koillinen"]
[null,"Itä",5,0.5,0.623,null,null,null,{"$f":"INT(0.2*0.15*$C$18/0.9+0.5)","v":5},0.5,0.623]
[null,"Kaakko"]
[null,"Etelä",10,0.5,0.56999999999999995,null,null,null,{"$f":"INT(0.4*0.15*$C$18/0.9+0.5)","v":10},0.5,0.56999999999999995]
[null,"Lounas"]
[null,"Länsi",5,0.5,0.623,null,null,null,{"$f":"INT(0.2*0.15*$C$18/0.9+0.5)","v":5},0.5,0.623]
[null,"Luode"]
[null,"Yhteensä",{"$f":"SUM(C30:C37)","v":25}]
[null,"Auringon lämpökuorma käyttöaikana keskimäärin",{"$f":"'Hki-2012'!CN21","v":340.94749251665462},"W"]
[]
[null,"Poistoilmalämpöpumpun tuottama lämpöä käytetään käyttöveden lämmittämiseen:"]
[null,"Lämpimän käyttöveden vuotuinen lämmitysenergiankulutus",35,"kWh/m²/a",null,null,null,null,{"$f":"CHOOSE(C17,35,35,6,4,40,11,20,30,35)","v":35}]
[null,"Lämpimän käyttöveden vuotuinen lämpöhäviöenergia",510,"kWh/a",null,null,null,null,{"$f":"INT(I42*C18/10/10)*10","v":510}]
[]
[null,"Poistoilmalämpöpumpun tiedot:"]
[null,"Poistoilmalämpöpumpun lämpökerroin, COP",2.5,null,null,null,null,null,2.5]
[null,"Poistoilmalämpöpumpun kompressorin sähköteho",350,"W",null,null,null,null,{"$f":"INT(1.2*E14*5*100)*10","v":350}]
[]
[null,"Ulkoilmavirran suhde poistoilmavirtaan PILP:ssa",{"$f":"D14/E14","v":0.89830508474576276}]
[null,"LTO-lämmönsiirtimen tiedot:"]
[null,"Tuloilman lämpötilasuhde yhtäsuurilla ilmavirroilla",0.6,null,null,null,null,null,0.6]
[null,"Tuloilman lämpötilasuhde",{"$f":"MIN(1,(C51>=0)*(C51<=1)*(2/(1+C49)*C51)+(C51>1)*(C51<=100)*(2/(1+C49)*C51/100)+(C51<0)*0+(C51>100)*0)","v":0.63214285714285712}]
[null,"Poistoilman lämpötilasuhde",{"$f":"MIN(1,C52*C49)","v":0.56785714285714284}]
[null,"Lämpötilat:"]
[null,"Huoneilman eli poistoilman lämpötila",21,"°C",null,null,null,null,21]
[null,"Poistoilman minimilämpötila LTO:n jäätymissuojauksessa",0,"°C",null,null,null,null,0]
[null,"Poistoilman minimilämpötila PILP:n jäätymissuojauksessa",0,"°C",null,null,null,null,0]
[null,"Tuloilman jälkilämmityksen asetuslämpötila",15,"°C",null,null,null,null,15]
[null,"Tuloilman jälkilämmitys PILP-varaajasta (1 = kyllä, 0 = ei)",1,null,{"$f":"'Hki-2012'!$BO$14","v":2},null,null,null,1]
[]
[null,"Poistoilmalämpöpumpun lämmöntalteenoton vuosihyötysuhde (ηa, PILP)"]
[null,"Säävyöhyke"]
[null,"I Helsinki-Vantaa TRY 2012 testivuosi",{"$f":"IF(NOW()<C69,IF(ABS('Hki-2012'!FT3)<0.002,'Hki-2012'!HB10,\"Laske!!!\"),\"vanhentunut\")","v":0.72107450591013367}]
[]
[null,"Poistoilmalämpöpumpun kompressorin sähkönkulutus",{"$f":"IF(NOW()<43100,IF(ABS('Hki-2012'!FT3)<0.002,'Hki-2012'!HD8,\"Laske!!!\"),\"vanhentunut\")","v":"vanhentunut"},"kWh/lämmityskausi"]
[]
[null,{"$f":"Ilmanvaihto!$A$40","v":"© Ympäristöministeriö, PILP-laskin 2018 (versio maaliskuu 2017)"}]
[]
[null,"Parasta ennen","2030-12-31"]

{"sheet":"Hki-2012","index":8,"n_rows":104,"n_cols":388,"rows_kept":104,"cut":false,"hidden":true,"merged":[]}
["Laskentataulukko, älä tuhoa"]
[]
[null,null,null,null,null,null,null,null,null,null,null,null,null,null,null,null,null,null,null,null,null,null,null,null,null,null,null,null,null,null,null,null,null,null,null,null,null,null,null,null,null,null,null,null,null,null,null,null,null,null,null,null,null,null,null,null,null,null,null,null,null,null,null,null,null,null,null,null,null,null,null,null,null,null,null,null,null,null,null,null,null,null,null,null,null,null,null,null,null,null,null,null,null,null,null,null,null,null,null,null,null,null,null,null,null,null,null,null,null,null,null,null,null,null,null,null,null,null,null,null,null,null,null,null,null,null,null,null,null,null,null,null,null,null,null,null,null,null,null,null,null,null,null,null,null,null,null,null,null,null,null,null,null,null,null,null,null,null,null,null,null,null,null,null,null,null,null,null,null,null,null,null,null,null,"iter",{"$f":"FX3*GC3+HY3*ID3+KA3*KF3+MC3*MH3","v":-3.4073319693561643E-4},null,null,null,{"$f":"(GO14=GP14)*(GO18=GP18)","v":0},null,null,null,null,{"$f":"GA23-HB23+GD3","v":-4.0454324334859848E-9},{"$f":"SUM(HA24:HC57)-SUM(FZ24:GB57)","v":-1.0069925338029861E-8},null,null,null,null,null,null,null,null,null,null,null,null,null,null,null,null,null,null,null,null,null,null,null,null,null,null,null,null,null,null,null,null,null,null,null,null,null,null,null,null,null,null,null,null,null,null,{"$f":"(IQ14=IR14)*(IQ18=IR18)","v":0},null,null,null,null,{"$f":"IB23-JD23+IE3","v":0},{"$f":"SUM(JC24:JE57)-SUM(IA24:IC57)","v":0},null,null,null,null,null,null,null,null,null,null,null,null,null,null,null,null,null,null,null,null,null,null,null,null,null,null,null,null,null,null,null,null,null,null,null,null,null,null,null,null,null,null,null,null,null,null,null,{"$f":"(KS14=KT14)*(KS18=KT18)","v":0},null,null,null,null,{"$f":"KD23-LF23+KG3","v":0},{"$f":"SUM(LE24:LG57)-SUM(KC24:KE57)","v":0},null,null,null,null,null,null,null,null,null,null,null,null,null,null,null,null,null,null,null,null,null,null,null,null,null,null,null,null,null,null,null,null,null,null,null,null,null,null,null,null,null,null,null,null,null,null,null,{"$f":"(MT14=MU14)*(MT18=MU18)","v":1},null,null,null,null,{"$f":"MF23-NG23+MI3","v":-3.4073319693561643E-4},{"$f":"SUM(NF24:NH57)-SUM(ME24:MG57)","v":-1.3024969084654003E-3}]
[]
[null,null,null,null,null,null,null,null,null,null,null,null,null,null,null,null,null,null,null,null,null,null,null,null,null,null,null,null,null,null,null,null,null,null,null,null,null,null,null,null,null,null,null,null,null,null,null,null,null,null,null,null,null,null,null,null,null,null,null,null,null,null,null,null,null,null,{"$f":"IF('Hki-2012'!BO14=2,\"Lauhdutin varaajassa!\",\"\")","v":"Lauhdutin varaajassa!"},null,null,null,null,null,null,null,null,null,null,null,null,null,null,null,null,null,null,null,null,null,null,null,null,null,null,null,null,null,null,null,null,null,null,null,null,null,null,null,null,null,null,null,null,null,null,null,null,null,null,null,null,null,null,null,null,null,null,null,null,null,null,null,null,null,null,null,null,null,null,null,null,null,null,null,null,null,null,null,null,null,null,null,null,null,null,null,null,null,null,null,null,null,null,null,null,null,null,null,null,null,null,null,null,null,null,null,null,{"$f":"FX5*GD5+HY5*IE5+KA5*KG5+MC5*MI5","v":0}]
[null,null,null,null,null,null,null,null,null,null,null,null,null,null,null,null,null,null,null,null,null,null,null,null,null,null,null,null,null,null,null,null,null,null,null,null,null,null,null,null,null,null,null,null,null,null,null,null,null,null,null,null,null,null,null,null,null,null,null,null,null,null,null,null,null,null,{"$f":"IF('Hki-2012'!BO14=1,\"Lauhdutin tuloilmassa!\",\"\")","v":""}]
[null,null,null,null,null,null,null,null,null,null,null,null,null,null,null,null,null,null,null,null,null,null,null,null,null,null,null,null,null,null,null,null,null,null,null,null,null,null,null,null,null,null,null,null,null,null,null,null,null,null,null,null,null,null,null,null,null,null,null,null,null,null,null,null,null,null,null,null,null,null,null,null,null,null,null,null,null,null,null,null,null,null,null,null,null,null,null,null,null,null,null,null,null,null,null,null,null,null,null,null,null,null,null,null,null,null,null,null,null,null,null,null,null,null,null,null,null,null,null,null,null,null,null,null,null,null,null,null,null,null,null,null,null,null,null,null,null,null,null,null,null,null,null,null,null,null,null,null,null,null,null,null,null,null,null,null,null,null,null,null,null,null,null,null,null,null,null,null,null,null,null,null,null,null,"Jakso",57]
[null,null,null,null,null,null,null,null,null,null,null,null,null,null,null,null,null,null,null,null,null,null,null,null,null,null,null,null,null,null,null,null,null,null,null,null,null,null,null,null,null,null,null,null,null,null,null,null,null,null,null,null,null,null,null,null,null,null,null,null,null,null,null,null,null,null,{"$f":"BO21","v":3714.8544520547944},{"$f":"BP21","v":368.2363013698631},0,null,null,null,null,null,null,null,null,null,null,null,null,null,null,null,null,null,null,null,null,null,null,null,null,null,null,null,null,null,null,null,null,null,null,null,null,null,null,null,null,null,null,null,null,null,null,null,null,null,null,null,null,null,null,null,null,null,null,null,null,null,null,null,null,null,null,null,null,null,null,null,null,null,null,null,null,null,null,null,null,null,null,null,null,null,null,null,null,null,null,null,null,null,null,null,null,null,null,null,null,null,null,null,null,null,null,null,null,null,null,null,null,null,null,null,null,null,null,null,null,null,null,null,null,null,null,null,null,null,null,null,null,null,null,null,null,null,null,null,null,null,null,{"$f":"HD12+JF12+LH12+NI12","v":2197.3571502977634},3296.0357254466448,5493.3928757444082,83318.045233130499,2443.0325252160324,5473.2518207129679,15331.627957927723,9838.235082183317,23858.318253424659,20464.808147896569,3296.0357254466448,2456.0987997693869,8805.5730000000003,5752.1345252160318,3053.4384747839686]
[null,null,null,null,null,null,null,null,null,null,null,null,null,null,null,null,null,null,null,null,null,null,null,null,null,null,null,null,null,null,null,null,null,null,null,null,null,null,null,null,null,null,null,null,null,null,null,null,null,null,null,null,null,null,null,null,null,null,null,null,null,null,null,null,null,null,null,null,null,null,null,null,null,null,null,null,null,null,"Käyttöajat","td","tw",null,null,null,null,null,null,null,null,null,null,null,null,null,null,null,null,null,null,null,null,null,null,null,null,null,null,null,null,null,null,null,null,null,null,null,null,null,null,null,null,null,null,null,null,null,null,null,null,null,null,null,null,null,null,null,null,null,null,null,null,null,null,null,null,null,null,null,null,null,null,null,null,null,null,null,null,null,null,null,null,null,null,null,null,null,null,null,null,null,null,null,null,null,"UILP",0]
[null,null,null,null,null,null,null,null,null,null,null,null,null,null,null,null,null,null,null,null,null,null,null,null,null,null,null,null,null,null,null,null,null,null,null,null,null,null,null,null,null,null,null,null,null,null,null,null,null,null,null,null,null,null,null,null,null,null,null,null,null,null,null,null,null,null,null,null,null,null,null,null,null,null,null,null,null,null,"Ilmanvaihto",{"$f":"MAX('PILP-laskin'!C19,1)","v":24},{"$f":"MAX('PILP-laskin'!C20,1)","v":7},null,null,null,null,null,null,null,null,null,null,null,null,null,null,null,null,null,null,null,null,null,null,null,null,null,null,null,null,null,null,null,null,null,null,null,null,null,null,null,null,null,null,null,null,null,null,null,null,null,null,null,null,null,null,null,null,null,null,null,null,null,null,null,null,null,null,null,null,null,null,null,null,null,null,null,null,null,null,null,null,null,null,null,null,null,null,null,null,null,null,null,null,null,null,null,null,null,null,null,null,null,null,null,null,null,null,null,null,null,null,null,null,null,null,null,null,null,null,null,null,null,null,null,null,null,null,null,"PILP:n LTO:n vuosihyötysuhde",{"$f":"(GP14=1)*(GP18=2)*HS19+(GP14=1)*(GP18=1)*JU19+(GP14=2)*(GP18=1)*LW19+(GP14=2)*(GP18=2)*NX19","v":0.72107450591013367}]
[null,null,null,null,null,null,null,"Nämä sarakkeet ovat vain kuvien piirtämistä varten",null,null,null,null,null,null,null,null,null,null,null,null,null,null,null,null,null,null,null,null,null,null,null,null,null,null,null,null,null,null,null,null,null,null,null,null,null,null,null,null,null,null,null,null,null,null,null,null,null,null,null,null,null,null,null,null,null,null,null,null,null,null,null,null,null,null,null,null,null,null,"Sisäiset kuormat",{"$f":"(CB10>0)*(CB10<3)*(CB10)+(CB10>2)*(CB10<24)*(CB10-2)+(CB10=24)*(CB10)","v":24},{"$f":"CC10","v":7},null,null,null,null,null,null,null,null,null,null,null,null,null,null,null,null,null,null,null,null,null,null,null,null,null,null,null,null,null,null,null,null,null,null,null,null,null,null,null,null,null,null,null,null,null,null,null,null,null,null,null,null,null,null,null,null,null,null,null,null,null,null,null,null,null,null,null,null,null,null,null,null,null,null,null,null,null,null,null,null,null,null,null,null,null,null,null,null,null,null,null,null,null,null,null,null,null,null,null,null,null,null,null,null,null,"1. Höyrystin poistoilmassa ennen LTO:a ja lauhdutin tuloilmassa",null,null,null,null,null,null,null,null,null,null,null,null,null,null,null,null,null,null,null,null,null,null,null,null,null,null,null,null,null,null,null,null,null,null,null,null,null,null,null,null,null,null,null,null,null,null,null,null,null,null,null,null,null,"2. Höyrystin jäteilmassa LTO:n jälkeen ja lauhdutin tuloilmassa",null,null,null,null,null,null,null,null,null,null,null,null,null,null,null,null,null,null,null,null,null,null,null,null,null,null,null,null,null,null,null,null,null,null,null,null,null,null,null,null,null,null,null,null,null,null,null,null,null,null,null,null,null,"3. Höyrystin jäteilmassa LTO:n jälkeen ja lauhdutin varaajassa",null,null,null,null,null,null,null,null,null,null,null,null,null,null,null,null,null,null,null,null,null,null,null,null,null,null,null,null,null,null,null,null,null,null,null,null,null,null,null,null,null,null,null,null,null,null,null,null,null,null,null,null,"4. Höyrystin poistoilmassa ennen LTO:a  ja lauhdutin varaajassa"]
[null,null,null,null,null,null,null,null,null,null,null,null,null,null,null,null,null,null,null,null,null,null,null,null,null,null,null,null,null,null,null,null,null,null,null,null,null,"IV-aikataulu",null,null,null,null,null,null,null,null,null,null,null,null,null,null,null,null,null,null,null,null,null,null,null,null,null,null,null,null,null,{"$f":"'PILP-laskin'!$C$53","v":0.56785714285714284},null,null,null,null,2,{"$f":"SUM(BV13:BV14)","v":2},null,null,null,null,"Aurinkokuormat",{"$f":"CB10","v":24},null,null,null,null,null,null,null,null,null,null,null,null,null,null,null,null,null,null,null,null,null,null,null,null,null,null,null,null,null,null,null,null,null,null,null,null,null,null,null,null,null,null,null,null,null,null,null,null,null,null,null,null,null,null,null,null,null,null,null,null,null,null,null,null,null,null,null,null,null,null,null,null,null,null,null,null,null,null,null,null,null,null,null,null,null,null,null,null,null,null,null,null,null,null,null,null,null,null,null,null,null,null,null,null,null,null,null,null,null,null,null,null,null,null,null,null,null,null,null,null,null,null,null,null,null,null,null,null,null,null,null,{"$f":"HD21*$FX$3","v":0},0,0,0,0,0,0,0,0,0,0,0,0,0,0,null,null,null,null,null,null,null,null,null,null,null,null,null,null,null,null,null,null,null,null,null,null,null,null,null,null,null,null,null,null,null,null,null,null,null,null,null,null,null,{"$f":"JF21*$HY$3","v":0},0,0,0,0,0,0,0,0,0,0,0,0,0,0,null,null,null,null,null,null,null,null,null,null,null,null,null,null,null,null,null,null,null,null,null,null,null,null,null,null,null,null,null,null,null,null,null,null,null,null,null,null,null,{"$f":"LH21*$KA$3","v":0},0,0,0,0,0,0,0,0,0,0,0,0,0,0,null,null,null,null,null,null,null,null,null,null,null,null,null,null,null,null,null,null,null,null,null,null,null,null,null,null,null,null,null,null,null,null,null,null,null,null,null,null,{"$f":"NI21*$MC$3","v":2197.3571502977634},3296.0357254466448,5493.3928757444082,83318.045233130499,2443.0325252160324,5473.2518207129679,15331.627957927723,9838.235082183317,23858.318253424659,20464.808147896569,3296.0357254466448,2456.0987997693869,8805.5730000000003,5752.1345252160318,3053.4384747839686]
[null,null,null,null,null,null,null,null,null,null,null,null,null,null,null,null,null,null,null,null,null,null,null,null,null,null,null,null,null,null,null,null,null,null,null,null,null,null,null,null,null,null,null,null,null,null,null,null,null,null,null,null,null,null,null,null,null,null,null,null,null,null,null,null,null,null,null,null,null,null,null,"1. Lauhdutin on tuloilmassa",1,{"$f":"BU13*($BU$12=1)","v":0},null,null,null,null,null,null,null,null,null,null,null,null,null,null,null,null,null,null,null,null,null,null,null,null,null,null,null,null,null,null,null,null,null,null,null,null,null,null,null,null,null,null,null,null,null,null,null,null,null,null,null,null,null,null,null,null,null,null,null,null,null,null,null,null,null,null,null,null,null,null,null,null,null,null,null,null,null,null,null,null,null,null,null,null,null,null,null,null,null,null,null,null,null,null,null,null,null,null,null,null,null,null,null,null,null,null,null,null,null,null,null,null,null,null,null,null,-50,"Näistä haetaan rajoitukset ja asetukset",null,null,null,null,null,null,null,null,null,null,null,null,null,null,null,null,null,null,null,null,null,null,null,null,null,null,null,null,null,null,null,null,null,null,null,null,null,null,null,null,null,null,null,null,null,null,null,null,null,null,null,null,"Näistä haetaan rajoitukset ja asetukset",null,null,null,null,null,null,null,null,null,null,null,null,null,null,null,null,null,null,null,null,null,null,null,null,null,null,null,null,null,null,null,null,null,null,null,null,null,null,null,null,null,null,null,null,null,null,null,null,null,null,null,null,null,"Näistä haetaan rajoitukset ja asetukset",null,null,null,null,null,null,null,null,null,null,null,null,null,null,null,null,null,null,null,null,null,null,null,null,null,null,null,null,null,null,null,null,null,null,null,null,null,null,null,null,null,null,null,null,null,null,null,null,null,null,null,null,null,"Näistä haetaan rajoitukset ja asetukset"]
[null,null,null,null,null,null,null,null,null,null,null,null,null,null,null,null,null,null,null,null,null,null,null,null,null,null,null,null,null,null,null,null,null,null,null,null,null,"lkv, D3/2012",{"$f":"AL15*'PILP-laskin'!$C$18/8760*6325","v":3714.8544520547944},"LKVvaraaja",{"$f":"AN15/8760*6325","v":368.23630136986299},null,null,null,null,null,null,null,null,null,null,null,null,null,null,null,null,null,null,null,null,null,null,null,null,null,{"$f":"(BV12=1)*1+(BV12<>1)*2","v":2},"Jos 1, niin lauhdutin on tuloilmassa, jos 2, niin lauhdutin on varaajassa",null,null,null,"2. Lauhdutin on varaajassa",2,{"$f":"BU14*($BU$12=2)","v":2},null,null,null,null,null,null,null,null,null,null,null,null,null,null,null,null,null,null,null,null,null,null,null,null,null,null,null,null,null,null,null,null,null,null,null,null,null,null,null,null,null,null,null,null,null,null,null,null,null,null,null,null,null,null,null,null,null,null,null,null,null,null,null,null,null,null,null,null,null,null,null,null,null,null,null,null,null,null,null,null,null,null,null,null,null,null,null,null,null,null,null,null,null,null,null,null,null,null,null,null,null,null,null,null,null,null,"poisto",null,{"$f":"MAX('PILP-laskin'!E14*1000,1E-50)","v":59},"dm³/s",null,null,null,null,null,null,null,"turha?",null,null,null,null,1,{"$f":"$BO$14","v":2},"Jos 1, niin lauhdutin on tuloilmassa, jos 2, niin lauhdutin on varaajassa",null,null,null,null,null,null,null,null,null,null,null,null,null,null,null,null,null,null,null,null,null,null,null,null,null,null,null,null,null,null,null,null,null,null,null,null,null,null,null,null,null,null,null,null,null,"turha?",null,null,null,null,null,1,{"$f":"$BO$14","v":2},"Jos 1, niin lauhdutin on tuloilmassa, jos 2, niin lauhdutin on varaajassa",null,null,null,null,null,null,null,null,null,null,null,null,null,null,null,null,null,null,null,null,null,null,null,null,null,null,null,null,null,null,null,null,null,null,null,null,null,null,null,null,null,null,null,null,null,"turha?",null,null,null,null,null,2,{"$f":"$BO$14","v":2},"Jos 1, niin lauhdutin on tuloilmassa, jos 2, niin lauhdutin on varaajassa",null,null,null,null,null,null,null,null,null,null,null,null,null,null,null,null,null,null,null,null,null,null,null,null,null,null,null,null,null,null,null,null,null,null,null,null,null,null,null,null,null,null,null,null,null,"turha?",null,null,null,null,2,{"$f":"$BO$14","v":2},"Jos 1, niin lauhdutin on tuloilmassa, jos 2, niin lauhdutin on varaajassa"]
[null,null,null,null,null,null,null,null,null,null,null,null,null,null,null,null,null,null,null,null,null,null,null,null,null,null,null,null,null,null,null,null,null,null,null,null,null,{"$f":"'PILP-laskin'!C42","v":35},"kWh/m², a",{"$f":"'PILP-laskin'!C43","v":510},"kWh/a",null,null,null,null,null,null,null,null,null,null,null,null,null,null,null,null,null,null,null,null,null,null,null,null,null,null,null,null,null,null,null,null,null,null,null,null,null,null,null,null,null,null,null,null,null,null,null,null,null,null,null,null,null,null,null,null,null,null,null,null,null,null,null,null,null,null,null,null,null,null,null,null,null,null,null,null,null,null,null,null,null,null,null,null,null,null,null,null,null,null,null,null,null,null,null,null,null,null,null,null,null,null,null,null,null,null,null,null,null,null,null,null,null,null,null,null,null,null,null,null,null,null,null,null,null,null,null,null,null,null,null,null,null,null,null,null,null,null,null,"tulo",null,{"$f":"MAX('PILP-laskin'!D14*1000,1E-50)","v":53},"dm³/s",null,null,null,null,null,"Tx,min","Tz,min","Ty,max","Tt,max","Tt2,min",null,null,null,null,null,null,null,null,null,null,null,null,null,null,null,null,null,null,null,null,{"$f":"(GV15-HC15)","v":0},null,null,null,null,null,null,null,null,null,null,null,null,null,null,null,null,null,null,null,null,null,null,null,null,null,null,null,"Tj,min","Tz,min","Ty,max","Tt,max","Tt2,min",null,null,null,null,null,null,null,null,null,null,null,null,null,null,null,null,null,null,null,null,null,null,null,null,null,null,null,null,null,null,null,null,null,null,null,null,null,null,null,null,null,null,null,null,null,null,null,null,null,"Tj,min","Tz,min","Ty,max","Tt,max","Tt2,min","PILP:llä = 0, ei PILP:llä = 1",null,null,null,null,null,null,null,null,null,{"$f":"MAX(KQ15+KT15+KY15-KX15-KP15,1.2*$GA$15*($KO$17-KJ15))","v":{"$error":"#VALUE!"}},null,null,null,null,null,null,null,null,null,null,null,null,null,null,null,null,null,null,null,null,null,null,null,null,null,null,null,null,null,null,null,null,null,null,null,null,null,null,"Tx,min","Tz,min","Ty,max","Tt,max","Tt2,min","PILP:llä = 0, ei PILP:llä = 1"]
[{"$f":"Ilmanvaihto!$A$40","v":"© Ympäristöministeriö, PILP-laskin 2018 (versio maaliskuu 2017)"},null,null,null,null,null,null,null,null,null,null,null,null,null,null,null,null,null,null,null,null,null,null,null,null,null,null,null,null,null,null,null,null,null,null,null,null,{"$f":"AL15/8.76","v":3.9954337899543382},"W/m²",{"$f":"AN17/'PILP-laskin'!$C$18","v":0.39604883049110057},"W/m²",null,null,null,null,null,null,null,null,null,null,null,null,null,null,null,null,null,null,null,null,null,null,null,null,null,null,null,null,null,null,null,2,{"$f":"SUM(BV17:BV19)","v":2},null,{"$f":"(BU16>0)*(BU16<3)","v":1},null,null,null,null,null,null,null,null,null,null,null,null,null,null,null,null,null,null,null,null,null,null,null,null,null,null,null,null,null,null,null,null,null,null,null,null,null,null,null,null,null,null,null,null,null,null,null,null,null,null,null,null,null,null,null,null,null,null,null,null,null,null,null,null,null,null,null,null,null,null,null,null,null,null,null,null,null,null,null,null,null,null,null,null,null,null,null,null,null,null,null,null,null,null,null,null,null,null,null,null,null,null,null,null,null,null,null,null,null,null,null,null,null,"PILP","LTO","LTO","PILP","Jälkilämm.",null,{"$f":"1.2*$GA$15*(GJ16-GI16)","v":{"$error":"#VALUE!"}},null,null,null,null,null,null,null,{"$f":"GM16+GP16+GU16-GT16-GL16","v":{"$error":"#VALUE!"}},null,null,null,null,null,null,null,null,null,null,{"$f":"(GP16+GM16+GU16-GL16-GT16-HC16)","v":{"$error":"#VALUE!"}},null,null,null,null,null,null,null,null,null,"Höyr",{"$f":"HN21","v":3279.5989726028392},{"$f":"HN21/HP21","v":0.37244583317892421},null,null,null,null,null,null,null,null,null,null,null,null,null,null,null,"PILP","LTO","LTO","PILP","Jälkilämm.",null,null,null,null,null,null,null,null,null,null,{"$f":"((IT16-IV16+IP16+IW16)>JO16)*(IT16-IV16+IP16+IW16)+((IT16-IV16+IP16+IW16)<JO16)*JO16","v":0},null,{"$f":"MIN(1.2*$GA$14*(IG16-IM16),HW16)","v":{"$error":"#VALUE!"}},null,null,null,null,null,null,null,null,null,null,null,null,null,null,null,null,null,null,"Höyr",{"$f":"JP21","v":2706.3864814285712},{"$f":"JP21/JR21","v":0.30734927544505863},null,null,null,null,null,null,null,null,null,null,null,null,null,null,null,"PILP","LTO","LTO","PILP","Jälkilämm.","Jälkilämmityksen energian lähde",null,null,null,null,null,null,null,null,null,{"$f":"((KV16-KX16+KR16+KY16)>LQ16)*(KV16-KX16+KR16+KY16)+((KV16-KX16+KR16+KY16)<LQ16)*LQ16","v":0},{"$f":"MIN(JZ16,KZ16)","v":0},{"$f":"MIN(1.2*$GA$14*(KI16-KK16),JY16)","v":{"$error":"#VALUE!"}},null,null,null,null,null,null,null,null,{"$f":"(KT16+KQ16+KY16-KP16-KX16-LG16)","v":{"$error":"#VALUE!"}},null,null,null,null,null,null,null,null,null,"Höyr",{"$f":"LR21","v":2706.3864814285712},{"$f":"LR21/LT21","v":0.30734927544505863},null,null,null,null,null,null,null,null,null,null,null,null,null,null,null,"PILP","LTO","LTO","PILP","Jälkilämm.","Jälkilämmityksen energian lähde",null,null,null,null,null,null,null,null,{"$f":"((MW16-MY16+MS16+MZ16)>NR16)*(MW16-MY16+MS16+MZ16)+((MW16-MY16+MS16+MZ16)<NR16)*NR16","v":0},{"$f":"MIN(MB16,NA16)","v":0},{"$f":"MIN(1.2*$GA$14*(MI16-MJ16),MA16)","v":0},null,null,null,null,null,null,null,null,{"$f":"(MU16+MR16+MZ16-MQ16-MY16-NH16)","v":{"$error":"#VALUE!"}},null,null,null,null,null,null,null,null,null,"Höyr",{"$f":"NS21","v":3296.0357254466448},{"$f":"NS21/NU21","v":0.37431246387334982}]
[null,null,null,null,null,null,null,null,null,null,null,null,null,null,null,null,null,null,null,null,null,null,null,{"$f":"MAX((Y17-AA17),AB17)","v":1000},{"$f":"1000","v":1000},null,null,null,null,null,null,null,null,null,null,null,null,{"$f":"AL16*'PILP-laskin'!$C$18","v":587.32876712328766},"W",{"$f":"AN15/8.76","v":58.219178082191782},"W",null,null,null,null,null,null,null,null,null,null,null,null,null,null,null,null,null,null,null,null,null,null,null,null,null,null,null,null,null,null,"1. Höyrystin poistoilmassa LTO:n jälkeen",1,{"$f":"BU17*($BU$16=1)","v":0},null,null,null,null,null,null,null,null,null,null,null,null,null,null,null,null,null,null,null,null,null,null,null,null,null,null,null,null,null,null,null,null,null,null,null,null,null,null,null,null,null,null,null,null,null,null,null,null,null,null,null,null,null,null,null,null,null,null,null,null,null,null,null,null,null,null,null,null,null,null,null,null,null,null,null,null,null,null,null,null,null,null,null,null,null,null,null,null,null,null,null,null,null,null,null,null,null,null,null,null,null,null,null,null,null,null,null,null,null,null,null,null,null,null,null,{"$f":"'PILP-laskin'!$C$57","v":0},{"$f":"(GC21>0.00001)*'PILP-laskin'!$C$56+(GC21<=0.00001)*$GI$13","v":0},50,50,{"$f":"MIN('PILP-laskin'!$C$58,GD21)","v":15},null,{"$f":"1.2*$GA$15*(GJ17-GI17)*(GH17<10)","v":3179.9999999999995},{"$f":"GM17-GL17-0*GN17","v":-15},null,null,null,null,null,null,{"$f":"((GR17-GT17+GN17+GU17)>HM17)*(GR17-GT17+GN17+GU17)+((GR17-GT17+GN17+GU17)<HM17)*HM17","v":3179.9999999999995},null,{"$f":"MIN(1.2*$GA$14*(GD17-GE17),FV17)","v":0},null,null,null,null,{"$f":"GE21","v":"Höyrystin poistoilmassa ennen LTO:a ja lauhdutin tuloilmassa"},null,null,null,null,null,null,null,null,null,{"$f":"MAX(1.2*$GA$15*($GL$17-GG17)-GL17,0)","v":938.99999999999989},null,null,null,"LTO+maa",{"$f":"HP21-HQ21","v":3062.7722684143055},{"$f":"(HP21-HQ21)/HP21","v":0.34782202911886656},null,null,null,null,null,null,null,null,null,null,null,null,null,null,null,{"$f":"'PILP-laskin'!$C$57","v":0},{"$f":"(ID21>0.00001)*'PILP-laskin'!$C$56+(ID21<=0.00001)*$GI$13","v":0},{"$f":"$GJ$17","v":50},{"$f":"$GK$17","v":50},{"$f":"MIN('PILP-laskin'!$C$58,IE21)","v":15},null,null,null,null,null,null,null,null,null,null,null,null,null,null,null,null,null,{"$f":"IG21","v":"Höyrystin poistoilmassa LTO:n jälkeen ja lauhdutin tuloilmassa"},null,null,null,null,null,null,null,null,null,null,null,null,null,"LTO+maa",{"$f":"JR21-JS21","v":4991.7648728571439},{"$f":"(JR21-JS21)/JR21","v":0.56688700131804526},null,null,null,null,null,null,null,null,null,null,null,null,null,null,null,{"$f":"'PILP-laskin'!$C$57","v":0},{"$f":"(KF21>0.00001)*'PILP-laskin'!$C$56+(KF21<=0.00001)*$GI$13","v":0},{"$f":"$GJ$17","v":50},{"$f":"$GK$17","v":50},{"$f":"MIN('PILP-laskin'!$C$58,KG21)","v":15},{"$f":"('PILP-laskin'!$C$59=0)*1","v":0},null,null,null,null,null,null,null,null,null,{"$f":"MAX(KQ17+KT17+KY17-KX17-KP17-$KP$17*KR17,1.2*$GA$15*($KO$17-KJ17))","v":953.99999999999989},{"$f":"MIN(JZ17,KZ17-$KP$17*KR17)","v":953.99999999999989},null,null,null,null,null,{"$f":"KI21","v":"Höyrystin poistoilmassa LTO:n jälkeen ja lauhdutin varaajassa"},null,null,null,null,null,null,null,null,null,null,null,null,null,"LTO+maa",{"$f":"LT21-LU21","v":4991.7648728571439},{"$f":"(LT21-LU21)/LT21","v":0.56688700131804526},null,null,null,null,null,null,null,null,null,null,null,null,null,null,null,{"$f":"'PILP-laskin'!$C$57","v":0},{"$f":"(MH21>0.00001)*'PILP-laskin'!$C$56+(MH21<=0.00001)*$GI$13","v":0},{"$f":"$GJ$17","v":50},{"$f":"$GK$17","v":50},{"$f":"MIN('PILP-laskin'!$C$58,MI21)","v":15},{"$f":"('PILP-laskin'!$C$59=0)*1","v":0},null,null,null,null,null,null,null,null,null,{"$f":"MIN(MB17,NA17-$MR$17*MS17)","v":0},null,null,null,null,null,{"$f":"MJ21","v":"Höyrystin poistoilmassa ennen LTO:a ja lauhdutin varaajassa"},null,null,null,null,null,null,null,null,null,null,null,null,null,"LTO+maa",{"$f":"NU21-NV21","v":3053.4384747839686},{"$f":"(NU21-NV21)/NU21","v":0.34676204203678379}]
[null,"Helsinki TRY 2012 testivuosi",null,null,null,null,null,null,null,null,null,null,null,null,null,null,{"$f":"O18-AE18*1000/(1.2*$GA$15)","v":0},null,null,null,null,null,null,{"$f":"AB18","v":0},null,null,null,null,null,null,null,null,null,null,null,null,null,{"$f":"AL17/($CB$10/24*$CC$10/7)","v":587.32876712328766},"W",{"$f":"AN17","v":58.219178082191782},"W",null,null,null,null,null,null,null,null,null,null,null,null,null,null,null,null,null,null,null,null,null,null,null,null,null,{"$f":"(BV16=1)*1+(BV16<>1)*2","v":2},"Jos 1, niin LTO on ennen höyrystintä, jos 2 tai muu, niin sen jälkeen",null,null,null,"2. Höyrystin poistoilmassa ennen LTO:a tai ilman LTO:a",2,{"$f":"BU18*($BU$16=2)","v":2},null,null,null,null,null,null,null,null,null,null,null,null,null,null,null,null,null,null,null,null,null,null,null,null,null,null,null,null,null,null,null,null,null,null,null,null,null,null,null,null,null,null,null,null,null,null,null,null,null,null,null,null,null,null,null,null,null,null,null,null,null,null,null,null,null,null,null,null,null,null,null,null,null,null,null,null,null,null,null,null,null,null,null,null,null,null,null,null,null,null,null,null,null,null,null,null,null,null,null,null,null,null,null,null,null,null,null,null,null,null,null,null,null,null,null,null,null,{"$f":"MAX(GI18,$GL$17*(GG18<10))","v":15},null,null,null,null,2,{"$f":"$BO$18","v":2},"Jos 1, niin LTO on ennen höyrystintä, jos 2 tai muu, niin sen jälkeen",null,null,null,null,null,null,null,null,null,null,null,null,null,null,null,null,null,null,null,null,null,null,null,null,null,null,null,null,null,null,null,null,null,null,null,null,null,null,null,null,null,null,null,null,null,null,null,null,null,null,null,1,{"$f":"$BO$18","v":2},"Jos 1, niin LTO on ennen höyrystintä, jos 2 tai muu, niin sen jälkeen",null,null,null,null,null,null,null,null,null,null,null,null,null,null,null,null,null,null,null,null,null,null,null,null,null,null,null,null,null,null,null,null,null,null,null,null,null,null,null,null,null,null,null,null,null,null,null,null,null,{"$f":"1.2*$GA$14*(KG18-B18)-$KP$17*KR18","v":{"$error":"#VALUE!"}},null,1,{"$f":"$BO$18","v":2},"Jos 1, niin LTO on ennen höyrystintä, jos 2 tai muu, niin sen jälkeen",null,null,null,null,null,null,null,null,null,null,null,null,null,null,null,null,null,null,null,null,null,null,null,null,null,null,null,null,null,null,null,null,null,null,null,null,null,null,null,null,null,null,null,{"$f":"'PILP-laskin'!$C$57","v":0},{"$f":"'PILP-laskin'!$C$56","v":0},null,null,null,null,null,2,{"$f":"$BO$18","v":2},"Jos 1, niin LTO on ennen höyrystintä, jos 2 tai muu, niin sen jälkeen"]
[null,null,{"$f":"5.3-3","v":2.2999999999999998},null,null,null,null,null,null,null,null,null,null,null,null,null,null,null,null,null,null,null,null,{"$f":"Y19-AA19","v":0},null,null,null,null,null,null,null,null,null,null,null,null,null,null,null,{"$f":"'PILP-laskin'!C22","v":0},"W",null,null,null,null,null,null,null,null,null,null,null,null,null,null,null,null,null,null,null,null,null,null,null,null,null,{"$f":"\"BO\"&$FT$7","v":"BO57"},{"$f":"\"BP\"&$FT$7","v":"BP57"},{"$f":"\"BQ\"&$FT$7","v":"BQ57"},null,null,null,null,null,null,null,null,null,"Lämpökuormien laskenta",null,null,null,null,null,null,null,null,null,null,null,null,{"$f":"\"CN\"&$FT$7","v":"CN57"},null,null,null,null,null,null,null,null,null,null,null,null,null,null,null,null,null,null,null,null,null,null,null,null,null,null,null,null,null,null,null,null,null,null,null,null,null,null,null,null,null,null,null,null,null,null,null,null,null,null,null,null,null,null,null,null,null,null,null,null,null,null,null,null,null,null,null,null,null,null,null,null,null,null,null,null,null,null,null,null,null,null,null,"Lähtötiedot",null,null,null,null,null,"Laskentatiedot",null,null,null,null,null,null,null,null,null,null,null,null,null,null,{"$f":"GM19-GL19-GN19","v":0},"ok","ok",null,null,null,"ok",{"$f":"\"GV\"&$FT$7","v":"GV57"},null,null,null,null,null,null,null,{"$f":"\"HD\"&$FT$7","v":"HD57"},{"$f":"\"HE\"&$FT$7","v":"HE57"},{"$f":"\"HF\"&$FT$7","v":"HF57"},{"$f":"\"HG\"&$FT$7","v":"HG57"},{"$f":"\"HH\"&$FT$7","v":"HH57"},{"$f":"\"HI\"&$FT$7","v":"HI57"},{"$f":"\"HJ\"&$FT$7","v":"HJ57"},{"$f":"\"HK\"&$FT$7","v":"HK57"},{"$f":"\"HL\"&$FT$7","v":"HL57"},{"$f":"\"HM\"&$FT$7","v":"HM57"},{"$f":"\"HN\"&$FT$7","v":"HN57"},{"$f":"\"HO\"&$FT$7","v":"HO57"},{"$f":"\"HP\"&$FT$7","v":"HP57"},{"$f":"\"HQ\"&$FT$7","v":"HQ57"},{"$f":"\"HR\"&$FT$7","v":"HR57"},{"$f":"(HN21+HP21-HQ21)/HP21","v":0.72026786229779072},null,"Lähtötiedot",null,null,null,null,null,"Laskentatiedot",null,null,null,null,null,null,null,null,null,null,null,null,null,null,null,null,null,null,null,null,null,null,{"$f":"\"IX\"&$FT$7","v":"IX57"},null,null,null,null,null,null,null,{"$f":"\"JF\"&$FT$7","v":"JF57"},{"$f":"\"JG\"&$FT$7","v":"JG57"},{"$f":"\"JH\"&$FT$7","v":"JH57"},{"$f":"\"JI\"&$FT$7","v":"JI57"},{"$f":"\"JJ\"&$FT$7","v":"JJ57"},{"$f":"\"JK\"&$FT$7","v":"JK57"},{"$f":"\"JL\"&$FT$7","v":"JL57"},{"$f":"\"JM\"&$FT$7","v":"JM57"},{"$f":"\"JN\"&$FT$7","v":"JN57"},{"$f":"\"JO\"&$FT$7","v":"JO57"},{"$f":"\"JP\"&$FT$7","v":"JP57"},{"$f":"\"JQ\"&$FT$7","v":"JQ57"},{"$f":"\"JR\"&$FT$7","v":"JR57"},{"$f":"\"JS\"&$FT$7","v":"JS57"},{"$f":"\"JT\"&$FT$7","v":"JT57"},{"$f":"(JP21+JR21-JS21)/JR21","v":0.87423627676310389},null,"Lähtötiedot",null,null,null,null,null,"Laskentatiedot",null,null,null,null,null,null,null,{"$f":"MAX(KH24,KK17)","v":0},null,null,null,null,null,{"$f":"1.2*$GA$14*(KG19-B19)","v":0},null,null,null,null,null,null,null,null,{"$f":"\"KZ\"&$FT$7","v":"KZ57"},null,null,null,null,null,null,null,{"$f":"\"LH\"&$FT$7","v":"LH57"},{"$f":"\"LI\"&$FT$7","v":"LI57"},{"$f":"\"LJ\"&$FT$7","v":"LJ57"},{"$f":"\"LK\"&$FT$7","v":"LK57"},{"$f":"\"LL\"&$FT$7","v":"LL57"},{"$f":"\"LM\"&$FT$7","v":"LM57"},{"$f":"\"LN\"&$FT$7","v":"LN57"},{"$f":"\"LO\"&$FT$7","v":"LO57"},{"$f":"\"LP\"&$FT$7","v":"LP57"},{"$f":"\"LQ\"&$FT$7","v":"LQ57"},{"$f":"\"LR\"&$FT$7","v":"LR57"},{"$f":"\"LS\"&$FT$7","v":"LS57"},{"$f":"\"LT\"&$FT$7","v":"LT57"},{"$f":"\"LU\"&$FT$7","v":"LU57"},{"$f":"\"LV\"&$FT$7","v":"LV57"},{"$f":"(LR21+LT21-LU21)/LT21","v":0.87423627676310389},null,"Lähtötiedot",{"$f":"\"LZ\"&$FT$7","v":"LZ57"},null,null,null,null,"Laskentatiedot",null,null,null,null,null,null,null,null,null,null,null,null,null,null,null,null,null,null,null,null,null,{"$f":"\"NA\"&$FT$7","v":"NA57"},null,null,null,null,null,null,null,{"$f":"\"NI\"&$FT$7","v":"NI57"},{"$f":"\"NJ\"&$FT$7","v":"NJ57"},{"$f":"\"NK\"&$FT$7","v":"NK57"},{"$f":"\"NL\"&$FT$7","v":"NL57"},{"$f":"\"NM\"&$FT$7","v":"NM57"},{"$f":"\"NN\"&$FT$7","v":"NN57"},{"$f":"\"NO\"&$FT$7","v":"NO57"},{"$f":"\"NP\"&$FT$7","v":"NP57"},{"$f":"\"NQ\"&$FT$7","v":"NQ57"},{"$f":"\"NR\"&$FT$7","v":"NR57"},{"$f":"\"NS\"&$FT$7","v":"NS57"},{"$f":"\"NT\"&$FT$7","v":"NT57"},{"$f":"\"NU\"&$FT$7","v":"NU57"},{"$f":"\"NV\"&$FT$7","v":"NV57"},{"$f":"\"NW\"&$FT$7","v":"NW57"},{"$f":"(NS21+NU21-NV21)/NU21","v":0.72107450591013367}]
[null,null,null,null,null,"Vaipan ominais-lämpöhäviö Hvaippa+vuotoilma, W",null,"Vaipan ominais-lämpöhäviö Hvaippa+vuotoilma, W",null,"Tp on poistoilman lämpötila","Tx on poistoilman lämpötila PILP:n höyrystimen jälkeen","Tz on poistoilman lämpötila LTO:n jälkeen","Tu on ulkoilman lämpötila ennen LTO:a","Ty on tuloilman lämpötila LTO:n jälkeen","Tt on tuloilman lämpötila PILP:n lauhduttimen jälkeen","Tt2 on tuloilman lämpötila jälkilämmityksen jälkeen","Ttkompr on tuloilman lämpötila PILP:n lauhduttimen jälkeen","Lauhduttimen tod. energia","Netto-lämmön-tarve","Tuloilman lämpötila bruttolämmöntarpeen mukaan","Tuloilman lämpötila nettolämmöntarpeen mukaan","Tuloilman jälkilämmitysteho","Muu lämmitys","Netto-lämmön-tarve","Brutto-lämmön-tarve","IV-brutto","hyödynnetyt lämpökuormat","Qlämmitys, koko lämmönatarve - hyödynnetyt lämpökuormat, joka voidaan kattaa PILP:llä ","Muu lämmitys (LKV, varaaja, muu vakio-lämmön-tarve","Kompr. tod. teho","Höyrystimen tod. teho","Lauhduttimen tod. teho","LTO:n teho, kW","PILP:n lauhduttimen ja LTO:n teho, kW","Käyttöveden lämmitysteho, kW","Varaajan lämpöhäviöteho, kW","Muu lämpöhäviöteho, kW","Qlkv, käyttöveden lämmityksen nettotehon-tarve","LKV-varaajan häviöt","Vakioteho ympäri vuoden, esimerkiksi järjestelmän lämpöhäviö ympäristöön",null,"Käyttövesi ja sen lämpöhäviö, kW","Käyttövesi, sen lämpöhäviö ja muu lämpöhäviö, kW","PILP:n lauhduttimen, LTO:n ja tuloilman jälkilämmityksen teho, kW",null,null,null,null,null,null,null,null,null,null,null,null,null,null,null,null,null,null,null,null,null,null,"Qlkv, käyttöveden lämmityksen energia","LKV-varaajan häviöenergia","Vakioenergia ympäri vuoden, esimerkiksi järjestelmän lämpöhäviö ympäristöön",null,null,null,null,null,null,null,null,null,"Läpäisykerroin (g x Fläpäisy)",{"$f":"'PILP-laskin'!$D$30*'PILP-laskin'!$E$30","v":0.36},{"$f":"'PILP-laskin'!$D$31*'PILP-laskin'!$E$31","v":0},{"$f":"'PILP-laskin'!$D$32*'PILP-laskin'!$E$32","v":0.3115},{"$f":"'PILP-laskin'!$D$33*'PILP-laskin'!$E$33","v":0},{"$f":"'PILP-laskin'!$D$34*'PILP-laskin'!$E$34","v":0.28499999999999998},{"$f":"'PILP-laskin'!$D$35*'PILP-laskin'!$E$35","v":0},{"$f":"'PILP-laskin'!$D$36*'PILP-laskin'!$E$36","v":0.3115},{"$f":"'PILP-laskin'!$D$37*'PILP-laskin'!$E$37","v":0},null,null,null,null,"Aur.kuorma keskimäärin, W","Lämpö-kuormat yhteensä",null,null,null,null,null,null,null,null,null,null,null,null,null,null,null,null,null,null,null,null,null,null,null,null,null,null,null,null,null,null,null,null,null,null,null,null,null,null,null,null,null,null,null,null,null,null,null,null,null,null,null,null,null,null,null,null,null,null,null,null,null,null,null,null,null,null,null,null,null,null,null,null,null,null,null,null,null,null,null,null,null,null,"Poistoilma-lämpöpumpun lämpökerroin","Kompr. maksimiteho, W","Höyrystimen maksimiteho, W","Lauhduttimen maksimiteho, W",null,"Poistoilma-lämpöpumpun lämpökerroin","Kompr. teho, W","Höyrystimen teho, W","Lauhduttimen teho, W","Annettu lämpötilahyötysuhde","Tp on poistoilman lämpötila","Tx on poistoilman lämpötila PILP:n höyrystimen jälkeen","Tz on poistoilman lämpötila LTO:n jälkeen","Tu on ulkoilman lämpötila ennen LTO:a","Ty on tuloilman lämpötila LTO:n jälkeen","Tt on tuloilman lämpötila PILP:n lauhduttimen jälkeen","Tt2 on tuloilman lämpötila jälkilämmityksen jälkeen","Tx,min rajoittaa PILP:n höyrystimen jälkeistä lämpötilaa rajoitusarvon ja ulkolämpötilan mukaan. Rajoitusarvo riippuu laitteen ominaisuuksista ja jäätymissuojauksesta. Ulkolämpötilan alle ei voi tasauslaskennassa jäähdyttää, koska ulkoilmalämpöpumpun tuottoa ei lasketa mukaan. Päivitetty TF9=1, niin saa jäähdyttää alle ulkoilman lämpötilan.","LTO:n teho","IV:n teho brutto","Tuloilman jälkilämmitysteho","IV:n teho netto tiloissa","Vaipan ominais-lämpöhäviö Hvaippa+vuotoilma, W","lämpökuormat","Lämpöhäviöteho huoneessa (vaippa + ilmanvaihto huoneessa = rakennusosat + vuotoilma + tuloilma tilassa + korvausilma)","Lämpö-kuormien lämpö-energian hyödyntä-misaste, ηlämpö, kaava (8.13 tai 8.14)","hyödynnetyt lämpökuormat","=($AN$21=1)*AN24+($AL$21=1)*AL24+($AM$21=1)*AM24","Qlämmitys","Lauhduttimen lämmön tarpeella rajoitettu teho, W","Höyrystimen  lämmön tarpeella rajoitettu teho, W","Kompr. raj teho, lauhdutintehon mukaan W","Kompr. raj. teho, höyrystintehon mukaan W","Kompr. tod. teho, W","Höyrystimen tod. teho, W","Lauhduttimen tod. teho, W","Qkompr.","Qhöyryst.","Qlauhd.","Muu kuin PILP-lämmitys","Tuloilman jälkilämmitys","hyödynnetyt lämpökuormat","Qlämmitys","Muu kuin PILP-lämmitys","Brutto-lämmön-tarve","Tuloilman lämpeneminen LTO:n jälkeen","Qhöyrystin, jossa ei ole ulkoilmasta otettu lämpöä",null,"Qilman-vaihto, brutto, lämmön-tarve yhteensä","Qilman-vaihto, netto, LTO ja maalämpö vähennetty","LTO",null,null,"Poistoilma-lämpöpumpun lämpökerroin","Kompr. maksimiteho, W","Höyrystimen maksimiteho, W","Lauhduttimen maksimiteho, W",null,"Poistoilma-lämpöpumpun lämpökerroin","Kompr. maksimiteho, W","Höyrystimen maksimiteho, W","Lauhduttimen maksimiteho, W","Annettu lämpötilahyötysuhde","Tp om poistoilman lämpötila","Tu on ulkoilman lämpötila ennen LTO:a","Tz on poistoilman lämpötila LTO:n jälkeen","Ty on tuloilman lämpötila LTO:n jälkeen","Tj on jäteilman lämpötila PILP:n höyrystimen jälkeen","Tt on tuloilman lämpötila PILP:n lauhduttimen jälkeen","Tt2 on tuloilman lämpötila jälkilämmityksen jälkeen",null,null,"LTO:n teho","IV:n teho brutto","Tuloilman jälkilämmitysteho","IV:n teho netto tiloissa","Vaipan ominais-lämpöhäviö Hvaippa+vuotoilma, W","lämpökuormat","Lämpöhäviöteho huoneessa (vaippa + ilmanvaihto huoneessa = rakennusosat + vuotoilma + tuloilma tilassa + korvausilma)","Lämpö-kuormien lämpö-energian hyödyntä-misaste, ηlämpö, kaava (8.13 tai 8.14)","hyödynnetyt lämpökuormat","=($AN$21=1)*AN24+($AL$21=1)*AL24+($AM$21=1)*AM24","Qlämmitys","Lauhduttimen lämmön tarpeella rajoitettu teho, W","Höyrystimen  lämmön tarpeella rajoitettu teho, W","Kompr. raj teho, lauhdutintehon mukaan W","Kompr. raj. teho, höyrystintehon mukaan W","Kompr. tod. teho, W","Höyrystimen tod. teho, W","Lauhduttimen tod. teho, W","Qkompr.","Qhöyryst.","Qlauhd.","Muu kuin PILP-lämmitys","Tuloilman jälkilämmitys","hyödynnetyt lämpökuormat","Qlämmitys","Muu kuin PILP-lämmitys","Brutto-lämmön-tarve","Tuloilman lämpeneminen LTO:n jälkeen","Qhöyrystin, jossa ei ole ulkoilmasta otettu lämpöä",null,"Qilman-vaihto, brutto, lämmön-tarve yhteensä","Qilman-vaihto, netto, LTO ja maalämpö vähennetty","LTO",null,null,"Poistoilma-lämpöpumpun lämpökerroin","Kompr. maksimiteho, W","Höyrystimen maksimiteho, W","Lauhduttimen maksimiteho, W",null,"Poistoilma-lämpöpumpun lämpökerroin","Kompr. maksimiteho, W","Höyrystimen maksimiteho, W","Lauhduttimen maksimiteho, W","Annettu lämpötilahyötysuhde","Tp om poistoilman lämpötila","Tu on ulkoilman lämpötila ennen LTO:a","Tz on poistoilman lämpötila LTO:n jälkeen","Ty on tuloilman lämpötila LTO:n jälkeen","Tj on jäteilman lämpötila PILP:n höyrystimen jälkeen","Tt on tuloilman lämpötila PILP:n lauhduttimen jälkeen","Tt2 on tuloilman lämpötila jälkilämmityksen jälkeen",null,null,"LTO:n teho","IV:n teho brutto","Tuloilman jälkilämmitysteho","IV:n teho netto tiloissa","Vaipan ominais-lämpöhäviö Hvaippa+vuotoilma, W","lämpökuormat","Lämpöhäviöteho huoneessa (vaippa + ilmanvaihto huoneessa = rakennusosat + vuotoilma + tuloilma tilassa + korvausilma)","Lämpö-kuormien lämpö-energian hyödyntä-misaste, ηlämpö, kaava (8.13 tai 8.14)","hyödynnetyt lämpökuormat","=($AN$21=1)*AN24+($AL$21=1)*AL24+($AM$21=1)*AM24","Qlämmitys","Lauhduttimen lämmön tarpeella rajoitettu teho, W","Höyrystimen  lämmön tarpeella rajoitettu teho, W","Kompr. raj teho, lauhdutintehon mukaan W","Kompr. raj. teho, höyrystintehon mukaan W","Kompr. tod. teho, W","Höyrystimen tod. teho, W","Lauhduttimen tod. teho, W","Qkompr.","Qhöyryst.","Qlauhd.","Muu kuin PILP-lämmitys","Tuloilman jälkilämmitys","hyödynnetyt lämpökuormat","Qlämmitys","Muu kuin PILP-lämmitys","Brutto-lämmön-tarve","Tuloilman lämpeneminen LTO:n jälkeen","Qhöyrystin, jossa ei ole ulkoilmasta otettu lämpöä",null,"Qilman-vaihto, brutto, lämmön-tarve yhteensä","Qilman-vaihto, netto, LTO ja maalämpö vähennetty","LTO",null,null,"Poistoilma-lämpöpumpun lämpökerroin","Kompr. maksimiteho, W","Höyrystimen maksimiteho, W","Lauhduttimen maksimiteho, W",null,"Poistoilma-lämpöpumpun lämpökerroin","Kompr. maksimiteho, W","Höyrystimen maksimiteho, W","Lauhduttimen maksimiteho, W","Annettu lämpötilahyötysuhde","Tp om poistoilman lämpötila","Tx on poistoilman lämpötila PILP:n höyrystimen jälkeen","Tz on poistoilman lämpötila LTO:n jälkeen","Tu on ulkoilman lämpötila ennen LTO:a","Ty on tuloilman lämpötila LTO:n jälkeen","Tt on tuloilman lämpötila PILP:n lauhduttimen jälkeen","Tt2 on tuloilman lämpötila jälkilämmityksen jälkeen","Tx,min rajoittaa PILP:n höyrystimen jälkeistä lämpötilaa rajoitusarvon ja ulkolämpötilan mukaan. Rajoitusarvo riippuu laitteen ominaisuuksista ja jäätymissuojauksesta. Ulkolämpötilan alle ei voi tasauslaskennassa jäähdyttää, koska ulkoilmalämpöpumpun tuottoa ei lasketa mukaan.","LTO:n teho","IV:n teho brutto","Tuloilman jälkilämmitysteho","IV:n teho netto tiloissa","Vaipan ominais-lämpöhäviö Hvaippa+vuotoilma, W","lämpökuormat","Lämpöhäviöteho huoneessa (vaippa + ilmanvaihto huoneessa = rakennusosat + vuotoilma + tuloilma tilassa + korvausilma)","Lämpö-kuormien lämpö-energian hyödyntä-misaste, ηlämpö, kaava (8.13 tai 8.14)","hyödynnetyt lämpökuormat","=($AN$21=1)*AN24+($AL$21=1)*AL24+($AM$21=1)*AM24","Qlämmitys","Lauhduttimen lämmön tarpeella rajoitettu teho, W","Höyrystimen  lämmön tarpeella rajoitettu teho, W","Kompr. raj teho, lauhdutintehon mukaan W","Kompr. raj. teho, höyrystintehon mukaan W","Kompr. tod. teho, W","Höyrystimen tod. teho, W","Lauhduttimen tod. teho, W","Qkompr.","Qhöyryst.","Qlauhd.","Muu kuin PILP-lämmitys","Tuloilman jälkilämmitys","hyödynnetyt lämpökuormat","Qlämmitys","Muu kuin PILP-lämmitys","Brutto-lämmön-tarve","Tuloilman lämpeneminen LTO:n jälkeen","Qhöyrystin, jossa ei ole ulkoilmasta otettu lämpöä","Brutto-lämmön-tarve","Qilman-vaihto, brutto, lämmön-tarve yhteensä","Qilman-vaihto, netto, LTO ja maalämpö vähennetty","LTO"]
[null,null,{"$f":"0*0.2","v":0},null,null,{"$f":"'PILP-laskin'!C21","v":88.2},null,null,null,{"$f":"'PILP-laskin'!$C$55","v":21},{"$f":"IF(($FX$3=1),GE21,IF(($HY$3=1),IG21,IF(($KA$3=1),KI21,IF(($MC$3=1),MJ21,\"Ei järjestelmää\"))))","v":"Höyrystin poistoilmassa ennen LTO:a ja lauhdutin varaajassa"},null,null,null,null,null,null,null,null,null,null,null,null,null,null,null,null,null,null,null,null,null,null,null,null,null,null,{"$f":"1*('PILP-laskin'!C42>0)*(BO14=2)","v":1},{"$f":"1*('PILP-laskin'!C43>0)*(BO14=2)","v":1},{"$f":"1*('PILP-laskin'!C22>0)","v":0},null,null,null,null,null,null,null,null,null,null,null,null,null,null,null,null,null,null,null,null,null,null,null,null,null,null,{"$f":"SUM(BO24:INDIRECT(BO19))*AL21","v":3714.8544520547944},{"$f":"SUM(BP24:INDIRECT(BP19))*AM21","v":368.2363013698631},{"$f":"SUM(BQ24:INDIRECT(BQ19))*AN21","v":0},null,null,null,null,null,null,null,null,null,"Ikkunapinta-ala, m²",{"$f":"'PILP-laskin'!$C$30","v":5},{"$f":"'PILP-laskin'!$C$31","v":0},{"$f":"'PILP-laskin'!$C$32","v":5},{"$f":"'PILP-laskin'!$C$33","v":0},{"$f":"'PILP-laskin'!$C$34","v":10},{"$f":"'PILP-laskin'!$C$35","v":0},{"$f":"'PILP-laskin'!$C$36","v":5},{"$f":"'PILP-laskin'!$C$37","v":0},null,null,"Lämpökuormat",null,{"$f":"CN22/($A$80*(MAX($CB$12,10))/24)*1000","v":340.94749251665462},"Qlämpökuorma",null,null,null,null,null,null,null,null,null,null,null,null,null,null,null,null,null,null,null,null,null,null,null,null,null,null,null,null,null,null,null,null,null,null,null,null,null,null,null,null,null,null,null,null,null,null,null,null,null,null,null,null,null,null,null,null,null,null,null,null,null,null,null,null,null,null,null,null,null,null,null,null,null,null,null,null,null,null,null,null,null,null,{"$f":"MAX('PILP-laskin'!$C$46,1E-50)","v":2.5},{"$f":"'PILP-laskin'!$C$47","v":350},null,null,null,null,null,null,null,{"$f":"'PILP-laskin'!$C$53","v":0.56785714285714284},{"$f":"'PILP-laskin'!$C$55","v":21},{"$f":"IF(GC21>0,\"Höyrystin poistoilmassa ennen LTO:a ja lauhdutin tuloilmassa\",\"Höyrystin poistoilmassa ja lauhdutin tuloilmassa\")","v":"Höyrystin poistoilmassa ennen LTO:a ja lauhdutin tuloilmassa"},null,null,null,null,null,null,null,{"$f":"1.2*$GA$14*(GD21-GG21)","v":1486.8},{"$f":"1.2*$GA$15*(GJ21-GI21)","v":0},null,null,null,"Qlämpöhäviö",null,null,"Qmuu lämmitys",{"$f":"SUM(GV24:INDIRECT(GV19))","v":112838.593178336},null,"Tp-Tx",null,null,"iter","iter","iter",{"$f":"SUM(HD24:INDIRECT(HD19))","v":2186.3993150685596},{"$f":"SUM(HE24:INDIRECT(HE19))","v":3279.5989726028392},{"$f":"SUM(HF24:INDIRECT(HF19))","v":5465.9982876713993},{"$f":"SUM(HG24:INDIRECT(HG19))","v":83318.045233129946},{"$f":"SUM(HH24:INDIRECT(HH19))","v":36.691999999999958},{"$f":"SUM(HI24:INDIRECT(HI19))","v":5491.3126151558054},{"$f":"SUM(HJ24:INDIRECT(HJ19))","v":15304.233369854548},{"$f":"SUM(HK24:INDIRECT(HK19))","v":9838.235082183317},{"$f":"SUM(HL24:INDIRECT(HL19))","v":23858.318253424659},{"$f":"SUM(HM24:INDIRECT(HM19))","v":31552.947945211072},{"$f":"SUM(HN24:INDIRECT(HN19))","v":3279.5989726028392},{"$f":"HP21-HR17-HR16","v":2463.2017589828556},{"$f":"SUM(HP24:INDIRECT(HP19))","v":8805.5730000000003},{"$f":"SUM(HQ24:INDIRECT(HQ19))","v":5742.8007315856948},{"$f":"HP21-HQ21","v":3062.7722684143055},null,null,{"$f":"MAX('PILP-laskin'!$C$46,1E-50)","v":2.5},{"$f":"'PILP-laskin'!$C$47","v":350},null,null,null,null,null,null,null,{"$f":"'PILP-laskin'!$C$53","v":0.56785714285714284},{"$f":"'PILP-laskin'!$C$55","v":21},null,{"$f":"IF(ID21>0,\"Höyrystin poistoilmassa LTO:n jälkeen ja lauhdutin tuloilmassa\",\"Höyrystin poistoilmassa ja lauhdutin tuloilmassa\")","v":"Höyrystin poistoilmassa LTO:n jälkeen ja lauhdutin tuloilmassa"},null,null,null,null,null,null,null,{"$f":"1.2*$GA$14*(IE21-IF21)","v":1486.8},{"$f":"MAX(1.2*$GA$15*($IM$17-IJ21),0)","v":953.99999999999989},{"$f":"IO21-IN21-IP21","v":532.80000000000007},null,null,"Qlämpöhäviö",null,null,"Qmuu lämmitys",{"$f":"SUM(IX24:INDIRECT(IX19))","v":101004.16228990696},null,"Tp-Tx",null,null,"iter","iter","iter",{"$f":"SUM(JF24:INDIRECT(JF19))","v":1804.2576542857146},{"$f":"SUM(JG24:INDIRECT(JG19))","v":2706.3864814285712},{"$f":"SUM(JH24:INDIRECT(JH19))","v":4510.6441357142849},{"$f":"SUM(JI24:INDIRECT(JI19))","v":83930.237289906945},{"$f":"SUM(JJ24:INDIRECT(JJ19))","v":151.25210142857142},{"$f":"SUM(JK24:INDIRECT(JK19))","v":5423.7608630268132},{"$f":"SUM(JL24:INDIRECT(JL19))","v":13442.792517540704},{"$f":"SUM(JM24:INDIRECT(JM19))","v":8932.1483818264205},{"$f":"SUM(JN24:INDIRECT(JN19))","v":23858.318253424659},{"$f":"SUM(JO24:INDIRECT(JO19))","v":8996.114999999998},{"$f":"SUM(JP24:INDIRECT(JP19))","v":2706.3864814285712},{"$f":"JR21-JT17-JT16","v":1107.4216457142852},{"$f":"SUM(JR24:INDIRECT(JR19))","v":8805.5730000000003},{"$f":"SUM(JS24:INDIRECT(JS19))","v":3813.8081271428568},{"$f":"JR21-JS21","v":4991.7648728571439},null,null,{"$f":"MAX('PILP-laskin'!$C$46,1E-50)","v":2.5},{"$f":"'PILP-laskin'!$C$47","v":350},null,null,null,null,null,null,null,{"$f":"'PILP-laskin'!$C$53","v":0.56785714285714284},{"$f":"'PILP-laskin'!$C$55","v":21},null,{"$f":"IF(KF21>0,\"Höyrystin poistoilmassa LTO:n jälkeen ja lauhdutin varaajassa\",\"Höyrystin poistoilmassa ja lauhdutin varaajassa\")","v":"Höyrystin poistoilmassa LTO:n jälkeen ja lauhdutin varaajassa"},null,null,null,null,null,null,null,{"$f":"1.2*$GA$14*(KG21-KH21)","v":1486.8},null,null,null,null,"Qlämpöhäviö",null,null,"Qmuu lämmitys",{"$f":"SUM(KZ24:INDIRECT(KZ19))","v":101004.16228990696},null,"Tp-Tx",null,null,"iter","iter","iter",{"$f":"SUM(LH24:INDIRECT(LH19))","v":1804.2576542857146},{"$f":"SUM(LI24:INDIRECT(LI19))","v":2706.3864814285712},{"$f":"SUM(LJ24:INDIRECT(LJ19))","v":4510.6441357142849},{"$f":"SUM(LK24:INDIRECT(LK19))","v":83930.237289906945},{"$f":"SUM(LL24:INDIRECT(LL19))","v":685.65880285714297},{"$f":"SUM(LM24:INDIRECT(LM19))","v":5423.7608630268132},{"$f":"SUM(LN24:INDIRECT(LN19))","v":13442.792517540704},{"$f":"SUM(LO24:INDIRECT(LO19))","v":8932.1483818264205},{"$f":"SUM(LP24:INDIRECT(LP19))","v":23858.318253424659},{"$f":"SUM(LQ24:INDIRECT(LQ19))","v":8996.114999999998},{"$f":"SUM(LR24:INDIRECT(LR19))","v":2706.3864814285712},{"$f":"LT21-LV17-LV16","v":1107.4216457142852},{"$f":"SUM(LT24:INDIRECT(LT19))","v":8805.5730000000003},{"$f":"SUM(LU24:INDIRECT(LU19))","v":3813.8081271428568},{"$f":"LT21-LU21","v":4991.7648728571439},null,null,{"$f":"MAX('PILP-laskin'!$C$46,1E-50)","v":2.5},{"$f":"'PILP-laskin'!$C$47","v":350},null,null,null,null,null,null,null,{"$f":"'PILP-laskin'!$C$53","v":0.56785714285714284},{"$f":"'PILP-laskin'!$C$55","v":21},{"$f":"IF(MH21>0,\"Höyrystin poistoilmassa ennen LTO:a ja lauhdutin varaajassa\",\"Höyrystin poistoilmassa ja lauhdutin varaajassa\")","v":"Höyrystin poistoilmassa ennen LTO:a ja lauhdutin varaajassa"},null,null,null,null,null,null,null,{"$f":"1.2*$GA$14*(MI21-ML21)","v":1486.8},null,null,null,null,"Qlämpöhäviö",null,null,"Qmuu lämmitys",{"$f":"SUM(NA24:INDIRECT(NA19))","v":112930.52132623256},null,"Tp-Tx",null,null,"iter","iter","iter",{"$f":"SUM(NI24:INDIRECT(NI19))","v":2197.3571502977634},{"$f":"SUM(NJ24:INDIRECT(NJ19))","v":3296.0357254466448},{"$f":"SUM(NK24:INDIRECT(NK19))","v":5493.3928757444082},{"$f":"SUM(NL24:INDIRECT(NL19))","v":83318.045233130499},{"$f":"SUM(NM24:INDIRECT(NM19))","v":2443.0325252160324},{"$f":"SUM(NN24:INDIRECT(NN19))","v":5473.2518207129679},{"$f":"SUM(NO24:INDIRECT(NO19))","v":15331.627957927723},{"$f":"SUM(NP24:INDIRECT(NP19))","v":9838.235082183317},{"$f":"SUM(NQ24:INDIRECT(NQ19))","v":23858.318253424659},{"$f":"SUM(NR24:INDIRECT(NR19))","v":20464.808147896569},{"$f":"SUM(NS24:INDIRECT(NS19))","v":3296.0357254466448},{"$f":"NU21-NW17-NW16","v":2456.0987997693869},{"$f":"SUM(NU24:INDIRECT(NU19))","v":8805.5730000000003},{"$f":"SUM(NV24:INDIRECT(NV19))","v":5752.1345252160318},{"$f":"NU21-NV21","v":3053.4384747839686}]
["Pysyvyys","Ulkolämpötila","Ulkoilman lämpötila esilämmityksen jälkeen","Qaur, Wh/m²","Qaur, W/m²","H, W","Jakso","H, kW",null,"Poistoilman lämpötila","Poistoilman lämpötila PILP:n höyrystimen jälkeen","Poistoilman lämpötila LTO:n jälkeen","Ulkoilman lämpötila","Tuloilman lämpötila LTO:n jälkeen","Tuloilman lämpötila PILP:n lauhduttimen jälkeen","Tuloilman lämpötila jälkilämmityksen jälkeen","Tuloilman lämpötila PILP:n kompressorin jälkeen","PILP:n lauhduttimen teho, kW","Nettolämmöntarve (hyödynnetyt lämpökuormat vähennetty), kW","Tuloilman lämpötila bruttolämmöntarpeen mukaan","Tuloilman lämpötila nettolämmöntarpeen mukaan","Tuloilman jälkilämmitysteho, kW","Muu lämmitys, kW","Nettolämmöntarve (hyödynnetyt lämpökuormat vähennetty), kW","Bruttolämmöntarve, kW",null,null,null,"Muu lämmitys","PILP:n kompressorin sähköteho, kW","PILP:n höyrystimen teho, kW","PILP:n lauhduttimen teho, kW","LTO:n teho, kW","PILP:n lauhduttimen ja LTO:n teho, kW","Käyttöveden lämmitysteho, kW","Varaajan lämpöhäviöteho, kW","Muu lämpöhäviöteho, kW","Käyttöveden lämmityksen nettotehontarve, W","Varaajan lämpöhäviöteho, W","Muu lämpöhäviöteho (vakioteho koko vuoden), W",null,"Käyttövesi ja sen lämpöhäviö, kW","Käyttövesi, sen lämpöhäviö ja muu lämpöhäviö, kW","PILP:n lauhduttimen, LTO:n ja tuloilman jälkilämmityksen teho, kW",null,null,null,null,null,null,null,null,null,null,null,null,null,null,null,null,null,null,null,null,null,null,"Qlkv","Qjärjestelmä","Qvakioenergia",null,null,null,null,null,null,null,null,null,"Auringon lämpökuormat ikkunoiden läpi, W","P","Ko","I","Ka","E","Lo","L","Lu","Aur.kuorma",null,"Muu kuorma","Yhteensä",{"$f":"SUM(CN24:INDIRECT(CN19))","v":2156.4928901678404},null,null,null,null,null,null,null,null,null,null,null,null,null,null,null,null,null,null,null,null,null,null,null,null,null,null,null,null,null,null,null,null,null,null,null,null,null,null,null,null,null,null,null,null,null,null,null,null,null,null,null,null,null,null,null,null,null,null,null,null,null,null,null,null,null,null,null,null,null,null,null,null,null,null,null,null,null,null,null,null,null,null,null,null,null,null,null,"Jakso",null,"paste","paste","paste","ηp","Tp","Tx","Tz","Tu","Ty","Tt","Tt2","Tx,min",null,null,null,null,"=$F22","=$CO22",null,null,null,"=$AO24-$AJ24-$AK24",{"$f":"GR22-GT22+GN22+GU22","v":{"$error":"#VALUE!"}},null,null,null,null,0.9,null,null,null,null,null,{"$f":"(GP22+GU22+GM22-GL22-GT22-HC22-GN22)","v":{"$error":"#VALUE!"}},null,null,null,null,null,{"$f":"MAX(1.2*$GA$15*($IM$17-GD22)-GL22-GA22,0)","v":{"$error":"#VALUE!"}},"Qhöyrystin4","B","Qilmanvaihto, tarve yhteensä","Qilmanvaihto, netto","Qlämmitys, lisäteho",null,null,{"$f":"'PILP-laskin'!$C$46+0*(0.0419*EW22+ 2.1194)","v":2.5},null,null,null,"Jakso",null,"paste","paste","paste","ηp","Tp","Tu","Tz","Ty","Tj","Tt","Tt2","Tz,min","Tj,min",{"$f":"IJ57-IH57","v":7.6168575920934423},null,{"$f":"MAX(1.2*$GA$15*($IM$17-IF22)-IN22-IC22,0)","v":{"$error":"#VALUE!"}},{"$f":"IO22-IN22","v":-7.6168575920934423},"=F22","=CO22",null,null,null,"=$AO24-$AJ24-$AK24",{"$f":"IT22-IV22+IP22+IW22","v":{"$error":"#VALUE!"}},{"$f":"MIN(HX22,IX22)","v":{"$error":"#VALUE!"}},{"$f":"MIN(1.2*$GA$14*(IG22-II22),HW22)","v":{"$error":"#VALUE!"}},{"$f":"IY22/HZ22","v":{"$error":"#VALUE!"}},{"$f":"IZ22/(HZ22-1)","v":{"$error":"#VALUE!"}},1,null,null,null,null,null,{"$f":"(IR22+IW22+IO22-IN22-IV22-JE22-IP22)","v":{"$error":"#VALUE!"}},null,null,null,{"$f":"JI22/1000*$FX22","v":{"$error":"#VALUE!"}},null,{"$f":"MAX(1.2*$GA$15*($IM$17-IF22)-IN22-IC22,0)","v":{"$error":"#VALUE!"}},"Qhöyrystin4","B","Qilmanvaihto, tarve yhteensä","Qilmanvaihto, netto","Qlämmitys, lisäteho",null,null,{"$f":"'PILP-laskin'!$C$46+0*(0.0419*GY22+ 2.1194)","v":2.5},null,null,null,"Jakso",null,"paste","paste","paste","ηp","Tp","Tu","Tz","Ty","Tj","Tt","Tt2","Tz,min","Tj,min",null,null,null,null,"=F22","=CO22",null,null,null,"=$AO24-$AJ24-$AK24",{"$f":"KV22-KX22+KR22+KY22","v":{"$error":"#VALUE!"}},null,null,null,null,1,null,null,null,null,null,{"$f":"(KT22+KY22+KQ22-KP22-KX22-LG22-KR22)","v":{"$error":"#VALUE!"}},null,null,{"$f":"KZ22/1000*$KA22","v":{"$error":"#VALUE!"}},{"$f":"LK22/1000*$FX22","v":{"$error":"#VALUE!"}},null,{"$f":"MAX(1.2*$GA$15*($IM$17-KH22)-KP22-KE22,0)","v":{"$error":"#VALUE!"}},"Qhöyrystin4","B","Qilmanvaihto, tarve yhteensä","Qilmanvaihto, netto","Qlämmitys, lisäteho",null,null,{"$f":"'PILP-laskin'!$C$46+0*(0.0419*JB22+ 2.1194)","v":{"$error":"#VALUE!"}},null,null,null,"Jakso",null,"paste","paste","paste","ηp","Tp","Tx","Tz","Tu","Ty","Tt","Tt2","Tx,min",null,null,null,null,"=$F22","=$CO22",null,null,null,"=$AO24-$AJ24-$AK24",{"$f":"MW22-MY22+MS22+MZ22","v":{"$error":"#VALUE!"}},null,null,null,null,1,null,null,null,null,null,{"$f":"(MU22+MZ22+MR22-MQ22-MY22-NH22-MS22)","v":{"$error":"#VALUE!"}},null,null,null,{"$f":"NL22/1000*$FX22","v":{"$error":"#VALUE!"}},null,{"$f":"MAX(1.2*$GA$15*($IM$17-MI22)-MQ22-MF22,0)","v":{"$error":"#VALUE!"}},"Qhöyrystin4","B","Qilmanvaihto, tarve yhteensä","Qilmanvaihto, netto","Qlämmitys, lisäteho"]
[null,null,null,null,null,null,"h",null,"°Ch",null,"Tx, Tj, PILP","Tz, LTO","Ulkoilman lämpötila","Ty, LTO","Tt, PILP","Tt2, LÄM","Tt, Kompr","kWh","kWh","Tt,brutto","Tt, netto","kW","kW","kW","kW","kW","kW","kW","kW","kW","kW","kW","kW","kW","kW","kW","kW","W","W","W",null,"kW","kW","kW",null,null,null,null,null,null,null,null,null,null,null,null,null,null,null,null,null,null,null,null,null,null,"kWh","kWh","kWh",null,null,null,null,null,null,null,null,null,"Suuntauksen muuntokerroin (talvikuukaudet)",0.50944527736131928,0.52383808095952022,0.68815592203898046,1.0482758620689656,1.2509745127436283,1.0488755622188906,0.6890554722638681,0.52473763118440775,"W","W (käyttöaika)",null,"W (käyttöaika)","kWh","W",null,null,null,null,null,null,null,null,null,null,null,null,null,null,null,null,null,null,null,null,null,null,null,null,null,null,null,null,null,null,null,null,null,null,null,null,null,null,null,null,null,null,null,null,null,null,null,null,null,null,null,null,null,null,null,null,null,null,null,null,null,null,null,null,null,null,null,null,null,null,null,null,null,null,null,null,null,null,null,null,null,null,null,"W",0,"W","h",null,"W",122735.99288253055,"W",null,null,"PILP","LTO","=$C23","LTO","PILP","LÄM","PILP","W","W","W","W","W","W","W",null,"W","W","W","W","W","W","W","W",{"$f":"HN21+HQ21+GV21+FT21*FU21+GH17*GI17","v":122735.99288252453},"W","kWh","kWh","kWh","W","kWh","kWh","kWh","kWh","kWh","W","kWh",null,"kWh","kWh","kWh",null,null,null,"W",0,"W","h",null,"W",108399.35689847839,"W",null,null,"=C23","LTO","LTO","PILP","PILP","LÄM","LTO","PILP","W","W","W","W","W","W","W",null,"W","W","W","W","W","W","W","W",{"$f":"JP21+JS21+IX21+HU21*HV21+II17*IJ17","v":108399.35689847839},"W","kWh","kWh","kWh","W","kWh","kWh","kWh","kWh","kWh","W","kWh",null,"kWh","kWh","kWh",null,null,null,"W",0,"W","h",null,"W",108399.35689847839,"W",null,null,"=C23","LTO","LTO","PILP","PILP","LÄM","LTO","PILP","W","W","W","W","W","W","W",null,"W","W","W","W","W","W","W","W",{"$f":"LR21+LU21+KZ21+JW21*JX21+KK17*KL17","v":108399.35689847839},"W","kWh","kWh","kWh","W","kWh","kWh","kWh","kWh","kWh","W","kWh",null,"kWh","kWh","kWh",null,null,null,"W",0,"W","h",null,"W",122853.69253865894,"W",null,null,"PILP","LTO","=$C23","LTO","PILP","LÄM","PILP","W","W","W","W","W","W","W",null,"W","W","W","W","W","W","W","W",{"$f":"NS21+NV21+NA21+LY21*LZ21+MM17*MN17","v":122853.69157689523},"W","kWh","kWh","kWh","W","kWh","kWh","kWh","kWh","kWh","W","kWh","W","kWh","kWh","kWh"]
[0,{"$f":"B25","v":-20.5},{"$f":"MAX($C$21*($C$19-B24)+B24,B24)","v":-20.5},null,null,{"$f":"$F$21*(J24-B24)","v":3660.3},{"$f":"(A24-A23)/100*8760","v":0},{"$f":"F24/1000","v":3.6603000000000003},{"$f":"G24*(J24-B24)","v":0},{"$f":"$FX$3*GD24+$HY$3*IE24+$KA$3*KG24+$MC$3*MI24","v":21},{"$f":"$FX$3*GE24+$HY$3*II24+$KA$3*KK24+$MC$3*MJ24","v":13.584745762711865},{"$f":"$FX$3*GF24+$HY$3*IG24+$KA$3*KI24+$MC$3*MK24","v":0},{"$f":"$FX$3*GG24+$HY$3*IF24+$KA$3*KH24+$MC$3*ML24","v":-20.5},{"$f":"$FX$3*GH24+$HY$3*IH24+$KA$3*KJ24+$MC$3*MM24","v":-5.3773584905660368},{"$f":"$FX$3*GI24+$HY$3*IJ24+$KA$3*KL24+$MC$3*MN24","v":-5.3773584905660368},{"$f":"$FX$3*GJ24+$HY$3*IK24+$KA$3*KM24+$MC$3*MO24","v":15},{"$f":"N24+AD24*1000/(1.2*$GA$15)","v":0.12578616352201433},{"$f":"AF24*G24","v":0},{"$f":"X24*G24","v":0},{"$f":"M24+Y24*1000/(1.2*$GA$15)","v":93.400124924614474},{"$f":"M24+X24*1000/(1.2*$GA$15)","v":85.079370207633332},{"$f":"($FX$3*GN24+$HY$3*IP24+$KA$3*KR24+$MC$3*MS24)/(1000)","v":1.296},{"$f":"Y24-AG24-AA24-AF24","v":4.8780479452054788},{"$f":"MAX((Y24-AA24),AB24)","v":6.714847945205479},{"$f":"H24+Z24+AC24","v":7.2440479452054793},{"$f":"($FX$3*GM24+$HY$3*IO24+$KA$3*KQ24+$MC$3*MR24)/(1000)","v":2.9381999999999997},{"$f":"($FX$3*GT24+$HY$3*IV24+$KA$3*KX24+$MC$3*MY24)/(1000)","v":0.52919999999999989},{"$f":"($FX$3*GV24+$HY$3*IX24+$KA$3*KZ24+$MC$3*NA24)/(1000)","v":5.7530479452054797},{"$f":"($FX$3*GU24+$HY$3*IW24+$KA$3*KY24+$MC$3*MZ24)/(1000)","v":0.64554794520547942},{"$f":"($FX$3*HA24+$HY$3*JC24+$KA$3*LE24+$MC$3*NF24)/(1000)","v":0.35},{"$f":"($FX$3*HB24+$HY$3*JD24+$KA$3*LF24+$MC$3*NG24)/(1000)","v":0.52500000000000002},{"$f":"($FX$3*HC24+$HY$3*JE24+$KA$3*LG24+$MC$3*NH24)/(1000)","v":0.875},{"$f":"($FX$3*GL24+$HY$3*IN24+$KA$3*KP24+$MC$3*MQ24)/(1000)","v":0.96179999999999999},{"$f":"AG24+AF24","v":1.8368},{"$f":"AL24/1000*$AL$21","v":0.58732876712328763},{"$f":"AM24/1000*$AM$21","v":5.8219178082191785E-2},{"$f":"AN24/1000*$AN$21","v":0},{"$f":"$AL$18","v":587.32876712328766},{"$f":"$AN$18","v":58.219178082191782},{"$f":"$AN$19","v":0},null,{"$f":"AI24+AJ24","v":0.64554794520547942},{"$f":"AP24+AK24","v":0.64554794520547942},{"$f":"AH24+V24","v":3.1328},null,null,null,null,null,null,null,null,null,null,null,null,null,null,null,null,null,null,null,null,null,null,{"$f":"AL24/1000*$G24","v":0},{"$f":"AM24/1000*$G24","v":0},0,null,null,null,null,null,null,null,null,null,null,{"$f":"CB$23*$E24*CB$21*CB$20","v":0},{"$f":"CC$23*$E24*CC$21*CC$20","v":0},0,0,0,0,0,0,{"$f":"SUM(CB24:CI24)","v":0},{"$f":"CJ24*24/(MAX($CB$12,10))","v":0},{"$f":"'PILP-laskin'!C27*$CB$11/$CB$10","v":529.19999999999993},{"$f":"CK24+CL24","v":529.19999999999993},{"$f":"CJ24*G24/1000","v":0},{"$f":"CM24","v":529.19999999999993},null,null,null,null,null,null,null,null,null,null,null,null,null,null,null,null,null,null,null,null,null,null,null,null,null,null,null,null,null,null,null,null,null,null,null,null,null,null,null,null,null,null,null,null,null,null,null,null,null,null,null,null,null,null,null,null,null,null,null,null,null,null,null,null,null,null,null,null,null,null,null,null,null,null,null,null,null,null,null,null,null,null,{"$f":"FT21","v":2.5},{"$f":"FU21","v":350},{"$f":"FU24*(FT24-1+1E-50)","v":525},{"$f":"FT24*FU24","v":875},0,{"$f":"FT24","v":2.5},350,525,875,{"$f":"$GC$21","v":0.56785714285714284},{"$f":"MAX($GD$21,GG24)","v":21},{"$f":"MAX(GD24-GA24/(1.2*$GA$14),GK24)","v":13.584745762711865},{"$f":"MAX(GE24-GC24*(GE24-GG24),$GI$17)","v":0},{"$f":"$C24","v":-20.5},{"$f":"MIN(GG24+$GA$14/$GA$15*(GE24-GF24),$GJ$17)","v":-5.3773584905660368},{"$f":"GH24+GB24/(1.2*$GA$15)","v":8.3805031446540905},{"$f":"MAX(GI24,$GL$17)","v":15},{"$f":"($FT$9=1)*$GH$17+($FT$9=0)*MAX($GH$17,GG24)","v":0},{"$f":"1.2*$GA$14*(GE24-GF24)","v":961.8},{"$f":"1.2*$GA$14*(GD24-B24)","v":2938.2},{"$f":"1.2*$GA$15*(GJ24-GI24)","v":420.99999999999983},{"$f":"GM24-GL24-GN24","v":1555.4},{"$f":"$F24","v":3660.3},{"$f":"$CO24","v":529.19999999999993},{"$f":"GP24+GO24","v":5215.7000000000007},{"$f":"MIN(1/(GQ24/(GR24+1E-50)+1E-50),1)","v":1},{"$f":"GS24*GQ24","v":529.19999999999993},{"$f":"($AN$21=1)*AN24+($AL$21=1)*AL24+($AM$21=1)*AM24","v":645.54794520547944},{"$f":"MAX(GM24+GP24+GU24-GT24-GL24,1.2*$GA$15*($GL$17-GH24))","v":5753.0479452054797},{"$f":"MIN(FW24,GV24)","v":875},{"$f":"MIN(1.2*$GA$14*(GD24-GK24),FV24)","v":525},{"$f":"GW24/FY24","v":350},{"$f":"GX24/(FY24-1+1E-50)","v":350},{"$f":"HA$22*MIN(GY24:GZ24)+(1-HA$22)*FZ24","v":350},{"$f":"HA24*(FY24-1)","v":525},{"$f":"HA24*FY24","v":875},{"$f":"HA24/1000*$FX24","v":0},{"$f":"HB24/1000*$FX24","v":0},{"$f":"HC24/1000*$FX24","v":0},{"$f":"(GV24-HC24)","v":4878.0479452054797},{"$f":"GN24/1000*$FX24","v":0},{"$f":"GT24/1000*$FX24","v":0},{"$f":"GV24/1000*$FX24","v":0},{"$f":"(HG24>0)*HG24/1000*$FX24","v":0},{"$f":"(GP24+GM24+GU24)/1000*$FX24","v":0},{"$f":"MAX(1.2*$GA$15*(GJ24-GG24)-GL24,0)","v":1295.9999999999998},{"$f":"HB24/1000*$FX24","v":0},null,{"$f":"GM24/1000*$FX24","v":0},{"$f":"(GM24-GL24)/1000*$FX24","v":0},null,null,null,{"$f":"$HU$21","v":2.5},{"$f":"$HV$21","v":350},{"$f":"HV24*(HU24-1+1E-50)","v":525},{"$f":"HU24*HV24","v":875},0,{"$f":"HU24","v":2.5},0,0,0,{"$f":"$ID$21","v":0.56785714285714284},{"$f":"MAX($IE$21,IF24)","v":21},{"$f":"$C24","v":-20.5},{"$f":"MAX(IE24-ID24*(IE24-IF24),IL24)","v":0},{"$f":"IF24+$GA$14/$GA$15*(IE24-IG24)","v":2.8773584905660385},{"$f":"MAX(IG24-IA24*(HZ24-1)/(1.2*$GA$14),IM24)","v":0},{"$f":"IH24+HZ24*IA24/(1.2*$GA$15)","v":2.8773584905660385},{"$f":"MAX(IJ24,$IM$17)","v":15},{"$f":"$IJ$17","v":0},{"$f":"($FT$9=1)*$II$17+($FT$9=0)*MAX($II$17,IF24)","v":0},{"$f":"1.2*$GA$14*(IE24-IG24)","v":1486.8},{"$f":"1.2*$GA$14*(IE24-B24)","v":2938.2},{"$f":"MAX(1.2*$GA$15*($IM$17-IJ24),0)","v":770.99999999999989},{"$f":"IO24-IN24-IP24","v":680.4},{"$f":"$F24","v":3660.3},{"$f":"$CO24","v":529.19999999999993},{"$f":"IR24+IQ24","v":4340.7},{"$f":"MIN(1/(IS24/(IT24+1E-50)+1E-50),1)","v":1},{"$f":"IU24*IS24","v":529.19999999999993},{"$f":"($AN$21=1)*AN24+($AL$21=1)*AL24+($AM$21=1)*AM24","v":645.54794520547944},{"$f":"MAX(IO24+IR24+IW24-IV24-IN24,1.2*$GA$15*($IM$17-IH24))","v":5228.0479452054797},875,{"$f":"MIN(1.2*$GA$14*(IG24-IM24),HW24)","v":0},{"$f":"IY24/HZ24","v":350},{"$f":"IZ24/(HZ24-1+1E-50)","v":0},{"$f":"JC$22*MIN(JA24:JB24)+(1-JC$22)*IA24","v":0},{"$f":"JC24*(HZ24-1)","v":0},{"$f":"JC24*HZ24","v":0},{"$f":"JC24/1000*$HY24","v":0},{"$f":"JD24/1000*$HY24","v":0},{"$f":"JE24/1000*$HY24","v":0},{"$f":"(IX24-JE24)","v":5228.0479452054797},{"$f":"IP24/1000*$HY24","v":0},{"$f":"IV24/1000*$HY24","v":0},{"$f":"IX24/1000*$HY24","v":0},{"$f":"(JI24>0)*JI24/1000*$HY24","v":0},{"$f":"(IR24+IO24+IW24)/1000*$HY24","v":0},{"$f":"MAX(1.2*$GA$15*($IM$17-IF24)-IN24,0)","v":770.99999999999977},{"$f":"JD24/1000*$HY24","v":0},null,{"$f":"IO24/1000*$HY24","v":0},{"$f":"(IO24-IN24)/1000*$HY24","v":0},null,null,null,{"$f":"$HU$21","v":2.5},{"$f":"$HV$21","v":350},{"$f":"JX24*(JW24-1+1E-50)","v":525},{"$f":"JW24*JX24","v":875},0,{"$f":"JW24","v":2.5},0,0,0,{"$f":"$ID$21","v":0.56785714285714284},{"$f":"MAX($KG$21,KH24)","v":21},{"$f":"$C24","v":-20.5},{"$f":"MAX(KG24-KF24*(KG24-KH24),KN24)","v":0},{"$f":"KH24+$GA$14/$GA$15*(KG24-KI24)","v":2.8773584905660385},{"$f":"MAX(KI24-KC24*(KB24-1)/(1.2*$GA$14),KO24)","v":0},{"$f":"KJ24+0*(KJ24+KB24*KC24/(1.2*$GA$15))","v":2.8773584905660385},{"$f":"MAX(KL24,$IM$17)","v":15},{"$f":"$IJ$17","v":0},{"$f":"($FT$9=1)*$KK$17+($FT$9=0)*MAX($KK$17,KH24)","v":0},{"$f":"1.2*$GA$14*(KG24-KI24)","v":1486.8},{"$f":"1.2*$GA$14*(KG24-B24)","v":2938.2},{"$f":"1.2*$GA$15*(KM24-KL24)","v":770.99999999999989},{"$f":"KQ24-KP24-KR24","v":680.4},{"$f":"$F24","v":3660.3},{"$f":"$CO24","v":529.19999999999993},{"$f":"KT24+KS24","v":4340.7},{"$f":"MIN(1/(KU24/(KV24+1E-50)+1E-50),1)","v":1},{"$f":"KW24*KU24","v":529.19999999999993},{"$f":"($AN$21=1)*AN24+($AL$21=1)*AL24+($AM$21=1)*AM24","v":645.54794520547944},{"$f":"MAX(KQ24+KT24+KY24-KX24-KP24,1.2*$GA$15*($KO$17-KJ24))","v":5228.0479452054797},{"$f":"MIN(JZ24,KZ24-$KP$17*KR24)","v":875},{"$f":"MIN(1.2*$GA$14*(KI24-KO24),JY24)","v":0},{"$f":"LA24/KB24","v":350},{"$f":"LB24/(KB24-1+1E-50)","v":0},{"$f":"LE$22*MIN(LC24:LD24)+(1-LE$22)*KC24","v":0},{"$f":"LE24*(KB24-1)","v":0},{"$f":"LE24*KB24","v":0},{"$f":"LE24/1000*$KA24","v":0},{"$f":"LF24/1000*$KA24","v":0},{"$f":"LG24/1000*$KA24","v":0},{"$f":"(KZ24-LG24)","v":5228.0479452054797},{"$f":"KR24/1000*$KA24","v":0},{"$f":"KX24/1000*$KA24","v":0},{"$f":"KZ24/1000*$KA24","v":0},{"$f":"(LK24>0)*LK24/1000*$KA24","v":0},{"$f":"(KT24+KQ24+KY24)/1000*$KA24","v":0},{"$f":"MAX(1.2*$GA$15*($KO$17-KH24)-KP24,0)","v":770.99999999999977},{"$f":"LF24/1000*$KA24","v":0},null,{"$f":"KQ24/1000*$KA24","v":0},{"$f":"(KQ24-KP24)/1000*$KA24","v":0},null,null,null,{"$f":"$LY$21","v":2.5},{"$f":"$LZ$21","v":350},{"$f":"LZ24*(LY24-1+1E-50)","v":525},{"$f":"LY24*LZ24","v":875},0,{"$f":"LY24","v":2.5},350,525,875,{"$f":"$MH$21","v":0.56785714285714284},{"$f":"MAX($MI$21,ML24)","v":21},{"$f":"MAX(MI24-MF24/(1.2*$GA$14),MP24)","v":13.584745762711865},{"$f":"MAX(MJ24-MH24*(MJ24-ML24),$MN$17)","v":0},{"$f":"$C24","v":-20.5},{"$f":"MIN(ML24+$GA$14/$GA$15*(MJ24-MK24),$MO$17)","v":-5.3773584905660368},{"$f":"MM24+0*(MM24+MG24/(1.2*$GA$15))","v":-5.3773584905660368},{"$f":"MAX(MN24,$MQ$17)","v":15},{"$f":"($FT$9=1)*$MM$17+($FT$9=0)*MAX($MM$17,ML24)","v":0},{"$f":"1.2*$GA$14*(MJ24-MK24)","v":961.8},{"$f":"1.2*$GA$14*(MI24-B24)","v":2938.2},{"$f":"1.2*$GA$15*(MO24-MN24)","v":1296},{"$f":"MR24-MQ24-MS24","v":680.39999999999986},{"$f":"$F24","v":3660.3},{"$f":"$CO24","v":529.19999999999993},{"$f":"MU24+MT24","v":4340.7},{"$f":"MIN(1/(MV24/(MW24+1E-50)+1E-50),1)","v":1},{"$f":"MX24*MV24","v":529.19999999999993},{"$f":"($AN$21=1)*AN24+($AL$21=1)*AL24+($AM$21=1)*AM24","v":645.54794520547944},{"$f":"MAX(MR24+MU24+MZ24-MY24-MQ24,1.2*$GA$15*($MQ$17-MM24))","v":5753.0479452054797},{"$f":"MIN(MB24,NA24-$MR$17*MS24)","v":875},{"$f":"MIN(1.2*$GA$14*(MI24-MP24),MA24)","v":525},{"$f":"NB24/MD24","v":350},{"$f":"NC24/(MD24-1+1E-50)","v":350},{"$f":"NF$22*MIN(ND24:NE24)+(1-NF$22)*ME24","v":350},{"$f":"NF24*(MD24-1)","v":525},{"$f":"NF24*MD24","v":875},{"$f":"NF24/1000*$MC24","v":0},{"$f":"NG24/1000*$MC24","v":0},{"$f":"NH24/1000*$MC24","v":0},{"$f":"(NA24-NH24)","v":4878.0479452054797},{"$f":"MS24/1000*$MC24","v":0},{"$f":"MY24/1000*$MC24","v":0},{"$f":"NA24/1000*$MC24","v":0},{"$f":"(NL24>0)*NL24/1000*$MC24","v":0},{"$f":"(MU24+MR24+MZ24)/1000*$MC24","v":0},{"$f":"MAX(1.2*$GA$15*($MQ$17-ML24)-MQ24,0)","v":1295.9999999999998},{"$f":"NG24/1000*$MC24","v":0},{"$f":"(MU24+MR24+MZ24)","v":7244.0479452054797},{"$f":"MR24/1000*$MC24","v":0},{"$f":"(MR24-MQ24)/1000*$MC24","v":0}]
[7.9908675799086767E-2,-20.5,{"$f":"MAX($C$21*($C$19-B25)+B25,B25)","v":-20.5},null,null,{"$f":"$F$21*(J25-B25)","v":3660.3},{"$f":"(A25-A24)/100*8760","v":7},{"$f":"F25/1000","v":3.6603000000000003},{"$f":"G25*(J25-B25)","v":290.5},{"$f":"$FX$3*GD25+$HY$3*IE25+$KA$3*KG25+$MC$3*MI25","v":21},{"$f":"$FX$3*GE25+$HY$3*II25+$KA$3*KK25+$MC$3*MJ25","v":13.584745762711865},{"$f":"$FX$3*GF25+$HY$3*IG25+$KA$3*KI25+$MC$3*MK25","v":0},{"$f":"$FX$3*GG25+$HY$3*IF25+$KA$3*KH25+$MC$3*ML25","v":-20.5},{"$f":"$FX$3*GH25+$HY$3*IH25+$KA$3*KJ25+$MC$3*MM25","v":-5.3773584905660368},{"$f":"$FX$3*GI25+$HY$3*IJ25+$KA$3*KL25+$MC$3*MN25","v":-5.3773584905660368},{"$f":"$FX$3*GJ25+$HY$3*IK25+$KA$3*KM25+$MC$3*MO25","v":15},{"$f":"N25+AD25*1000/(1.2*$GA$15)","v":0.12578616352201433},{"$f":"AF25*G25","v":6.125},{"$f":"X25*G25","v":47.003935616438355},{"$f":"M25+Y25*1000/(1.2*$GA$15)","v":93.400124924614474},{"$f":"M25+X25*1000/(1.2*$GA$15)","v":85.079370207633332},{"$f":"($FX$3*GN25+$HY$3*IP25+$KA$3*KR25+$MC$3*MS25)/(1000)","v":1.296},{"$f":"Y25-AG25-AA25-AF25","v":4.8780479452054788},{"$f":"MAX((Y25-AA25),AB25)","v":6.714847945205479},{"$f":"H25+Z25+AC25","v":7.2440479452054793},{"$f":"($FX$3*GM25+$HY$3*IO25+$KA$3*KQ25+$MC$3*MR25)/(1000)","v":2.9381999999999997},{"$f":"($FX$3*GT25+$HY$3*IV25+$KA$3*KX25+$MC$3*MY25)/(1000)","v":0.52919999999999989},5.7530479452054797,0.64554794520547942,0.35,0.52500000000000002,0.875,{"$f":"($FX$3*GL25+$HY$3*IN25+$KA$3*KP25+$MC$3*MQ25)/(1000)","v":0.96179999999999999},{"$f":"AG25+AF25","v":1.8368},{"$f":"AL25/1000*$AL$21","v":0.58732876712328763},{"$f":"AM25/1000*$AM$21","v":5.8219178082191785E-2},{"$f":"AN25/1000*$AN$21","v":0},{"$f":"$AL$18","v":587.32876712328766},{"$f":"$AN$18","v":58.219178082191782},{"$f":"$AN$19","v":0},null,{"$f":"AI25+AJ25","v":0.64554794520547942},{"$f":"AP25+AK25","v":0.64554794520547942},{"$f":"AH25+V25","v":3.1328},null,null,null,null,null,null,null,null,null,null,null,null,null,null,null,null,null,null,null,null,null,null,{"$f":"AL25/1000*$G25","v":4.1113013698630132},{"$f":"AM25/1000*$G25","v":0.40753424657534248},{"$f":"AN25/1000*$G25","v":0},null,null,null,null,null,null,null,null,null,null,{"$f":"CB$23*$E25*CB$21*CB$20","v":0},0,0,0,0,0,0,0,{"$f":"SUM(CB25:CI25)","v":0},{"$f":"CJ25*24/(MAX($CB$12,10))","v":0},{"$f":"CL24","v":529.19999999999993},{"$f":"CK25+CL25","v":529.19999999999993},{"$f":"CJ25*G25/1000","v":0},{"$f":"CM25","v":529.19999999999993},null,null,null,null,null,null,null,null,null,null,null,null,null,null,null,null,null,null,null,null,null,null,null,null,null,null,null,null,null,null,null,null,null,null,null,null,null,null,null,null,null,null,null,null,null,null,null,null,null,null,null,null,null,null,null,null,null,null,null,null,null,null,null,null,null,null,null,null,null,null,null,null,null,null,null,null,null,null,null,null,null,null,{"$f":"FT24","v":2.5},{"$f":"FU24","v":350},525,{"$f":"FT25*FU25","v":875},7,{"$f":"FT25","v":2.5},350,525,875,{"$f":"GC24","v":0.56785714285714284},{"$f":"MAX($GD$21,GG25)","v":21},{"$f":"MAX(GD25-GA25/(1.2*$GA$14),GK25)","v":13.584745762711865},0,{"$f":"$C25","v":-20.5},{"$f":"MIN(GG25+$GA$14/$GA$15*(GE25-GF25),$GJ$17)","v":-5.3773584905660368},{"$f":"GH25+GB25/(1.2*$GA$15)","v":8.3805031446540905},{"$f":"MAX(GI25,$GL$17)","v":15},{"$f":"($FT$9=1)*$GH$17+($FT$9=0)*MAX($GH$17,GG25)","v":0},{"$f":"1.2*$GA$14*(GE25-GF25)","v":961.8},{"$f":"1.2*$GA$14*(GD25-B25)","v":2938.2},{"$f":"1.2*$GA$15*(GJ25-GI25)","v":420.99999999999983},{"$f":"GM25-GL25-GN25","v":1555.4},{"$f":"$F25","v":3660.3},{"$f":"$CO25","v":529.19999999999993},{"$f":"GP25+GO25","v":5215.7000000000007},{"$f":"MIN(1/(GQ25/(GR25+1E-50)+1E-50),1)","v":1},{"$f":"GS25*GQ25","v":529.19999999999993},{"$f":"($AN$21=1)*AN25+($AL$21=1)*AL25+($AM$21=1)*AM25","v":645.54794520547944},{"$f":"MAX(GM25+GP25+GU25-GT25-GL25,1.2*$GA$15*($GL$17-GH25))","v":5753.0479452054797},{"$f":"MIN(FW25,GV25)","v":875},{"$f":"MIN(1.2*$GA$14*(GD25-GK25),FV25)","v":525},350,{"$f":"GX25/(FY25-1+1E-50)","v":350},{"$f":"HA$22*MIN(GY25:GZ25)+(1-HA$22)*FZ25","v":350},525,875,2.4499999999999997,{"$f":"HB25/1000*$FX25","v":3.6750000000000003},6.125,{"$f":"(GV25-HC25)","v":4878.0479452054797},{"$f":"GN25/1000*$FX25","v":2.9469999999999987},{"$f":"GT25/1000*$FX25","v":3.7043999999999992},{"$f":"GV25/1000*$FX25","v":40.271335616438357},{"$f":"(HG25>0)*HG25/1000*$FX25","v":34.146335616438357},{"$f":"(GP25+GM25+GU25)/1000*$FX25","v":50.708335616438355},{"$f":"MAX(1.2*$GA$15*(GJ25-GG25)-GL25,0)","v":1295.9999999999998},{"$f":"HB25/1000*$FX25","v":3.6750000000000003},null,{"$f":"GM25/1000*$FX25","v":20.567399999999999},{"$f":"(GM25-GL25)/1000*$FX25","v":13.8348},null,null,null,{"$f":"HU24","v":2.5},{"$f":"HV24","v":350},525,875,7,{"$f":"HU25","v":2.5},0,0,0,{"$f":"ID24","v":0.56785714285714284},{"$f":"MAX($IE$21,IF25)","v":21},{"$f":"$C25","v":-20.5},{"$f":"MAX(IE25-ID25*(IE25-IF25),IL25)","v":0},{"$f":"IF25+$GA$14/$GA$15*(IE25-IG25)","v":2.8773584905660385},{"$f":"MAX(IG25-IA25*(HZ25-1)/(1.2*$GA$14),IM25)","v":0},{"$f":"IH25+HZ25*IA25/(1.2*$GA$15)","v":2.8773584905660385},{"$f":"MAX(IJ25,$IM$17)","v":15},{"$f":"IL24","v":0},{"$f":"($FT$9=1)*$II$17+($FT$9=0)*MAX($II$17,IF25)","v":0},{"$f":"1.2*$GA$14*(IE25-IG25)","v":1486.8},{"$f":"1.2*$GA$14*(IE25-B25)","v":2938.2},770.99999999999989,680.4,{"$f":"$F25","v":3660.3},{"$f":"$CO25","v":529.19999999999993},{"$f":"IR25+IQ25","v":4340.7},{"$f":"MIN(1/(IS25/(IT25+1E-50)+1E-50),1)","v":1},{"$f":"IU25*IS25","v":529.19999999999993},{"$f":"($AN$21=1)*AN25+($AL$21=1)*AL25+($AM$21=1)*AM25","v":645.54794520547944},{"$f":"MAX(IO25+IR25+IW25-IV25-IN25,1.2*$GA$15*($IM$17-IH25))","v":5228.0479452054797},875,{"$f":"MIN(1.2*$GA$14*(IG25-IM25),HW25)","v":0},{"$f":"IY25/HZ25","v":350},{"$f":"IZ25/(HZ25-1+1E-50)","v":0},{"$f":"JC$22*MIN(JA25:JB25)+(1-JC$22)*IA25","v":0},{"$f":"JC25*(HZ25-1)","v":0},{"$f":"JC25*HZ25","v":0},{"$f":"JC25/1000*$HY25","v":0},{"$f":"JD25/1000*$HY25","v":0},{"$f":"JE25/1000*$HY25","v":0},{"$f":"(IX25-JE25)","v":5228.0479452054797},{"$f":"IP25/1000*$HY25","v":5.3969999999999994},{"$f":"IV25/1000*$HY25","v":3.7043999999999992},{"$f":"IX25/1000*$HY25","v":36.596335616438353},{"$f":"(JI25>0)*JI25/1000*$HY25","v":36.596335616438353},{"$f":"(IR25+IO25+IW25)/1000*$HY25","v":50.708335616438355},{"$f":"MAX(1.2*$GA$15*($IM$17-IF25)-IN25,0)","v":770.99999999999977},{"$f":"JD25/1000*$HY25","v":0},null,{"$f":"IO25/1000*$HY25","v":20.567399999999999},{"$f":"(IO25-IN25)/1000*$HY25","v":10.159799999999999},null,null,null,{"$f":"JW24","v":2.5},{"$f":"JX24","v":350},525,875,7,{"$f":"JW25","v":2.5},0,0,0,{"$f":"KF24","v":0.56785714285714284},{"$f":"MAX($KG$21,KH25)","v":21},{"$f":"$C25","v":-20.5},{"$f":"MAX(KG25-KF25*(KG25-KH25),KN25)","v":0},{"$f":"KH25+$GA$14/$GA$15*(KG25-KI25)","v":2.8773584905660385},{"$f":"MAX(KI25-KC25*(KB25-1)/(1.2*$GA$14),KO25)","v":0},{"$f":"KJ25+0*(KJ25+KB25*KC25/(1.2*$GA$15))","v":2.8773584905660385},{"$f":"MAX(KL25,$IM$17)","v":15},{"$f":"KN24","v":0},{"$f":"($FT$9=1)*$KK$17+($FT$9=0)*MAX($KK$17,KH25)","v":0},{"$f":"1.2*$GA$14*(KG25-KI25)","v":1486.8},2938.2,{"$f":"1.2*$GA$15*(KM25-KL25)","v":770.99999999999989},{"$f":"KQ25-KP25-KR25","v":680.4},{"$f":"$F25","v":3660.3},{"$f":"$CO25","v":529.19999999999993},{"$f":"KT25+KS25","v":4340.7},{"$f":"MIN(1/(KU25/(KV25+1E-50)+1E-50),1)","v":1},{"$f":"KW25*KU25","v":529.19999999999993},{"$f":"($AN$21=1)*AN25+($AL$21=1)*AL25+($AM$21=1)*AM25","v":645.54794520547944},5228.0479452054797,{"$f":"MIN(JZ25,KZ25-$KP$17*KR25)","v":875},{"$f":"MIN(1.2*$GA$14*(KI25-KO25),JY25)","v":0},{"$f":"LA25/KB25","v":350},{"$f":"LB25/(KB25-1+1E-50)","v":0},{"$f":"LE$22*MIN(LC25:LD25)+(1-LE$22)*KC25","v":0},{"$f":"LE25*(KB25-1)","v":0},{"$f":"LE25*KB25","v":0},{"$f":"LE25/1000*$KA25","v":0},{"$f":"LF25/1000*$KA25","v":0},{"$f":"LG25/1000*$KA25","v":0},{"$f":"(KZ25-LG25)","v":5228.0479452054797},{"$f":"KR25/1000*$KA25","v":5.3969999999999994},{"$f":"KX25/1000*$KA25","v":3.7043999999999992},{"$f":"KZ25/1000*$KA25","v":36.596335616438353},{"$f":"(LK25>0)*LK25/1000*$KA25","v":36.596335616438353},{"$f":"(KT25+KQ25+KY25)/1000*$KA25","v":50.708335616438355},{"$f":"MAX(1.2*$GA$15*($KO$17-KH25)-KP25,0)","v":770.99999999999977},{"$f":"LF25/1000*$KA25","v":0},null,{"$f":"KQ25/1000*$KA25","v":20.567399999999999},{"$f":"(KQ25-KP25)/1000*$KA25","v":10.159799999999999},null,null,null,{"$f":"LY24","v":2.5},{"$f":"LZ24","v":350},525,875,7,{"$f":"LY25","v":2.5},350,525,875,{"$f":"MH24","v":0.56785714285714284},{"$f":"MAX($MI$21,ML25)","v":21},{"$f":"MAX(MI25-MF25/(1.2*$GA$14),MP25)","v":13.584745762711865},{"$f":"MAX(MJ25-MH25*(MJ25-ML25),$MN$17)","v":0},{"$f":"$C25","v":-20.5},{"$f":"MIN(ML25+$GA$14/$GA$15*(MJ25-MK25),$MO$17)","v":-5.3773584905660368},{"$f":"MM25+0*(MM25+MG25/(1.2*$GA$15))","v":-5.3773584905660368},{"$f":"MAX(MN25,$MQ$17)","v":15},{"$f":"($FT$9=1)*$MM$17+($FT$9=0)*MAX($MM$17,ML25)","v":0},961.8,{"$f":"1.2*$GA$14*(MI25-B25)","v":2938.2},{"$f":"1.2*$GA$15*(MO25-MN25)","v":1296},{"$f":"MR25-MQ25-MS25","v":680.39999999999986},{"$f":"$F25","v":3660.3},{"$f":"$CO25","v":529.19999999999993},{"$f":"MU25+MT25","v":4340.7},{"$f":"MIN(1/(MV25/(MW25+1E-50)+1E-50),1)","v":1},{"$f":"MX25*MV25","v":529.19999999999993},{"$f":"($AN$21=1)*AN25+($AL$21=1)*AL25+($AM$21=1)*AM25","v":645.54794520547944},{"$f":"MAX(MR25+MU25+MZ25-MY25-MQ25,1.2*$GA$15*($MQ$17-MM25))","v":5753.0479452054797},{"$f":"MIN(MB25,NA25-$MR$17*MS25)","v":875},{"$f":"MIN(1.2*$GA$14*(MI25-MP25),MA25)","v":525},350,{"$f":"NC25/(MD25-1+1E-50)","v":350},{"$f":"NF$22*MIN(ND25:NE25)+(1-NF$22)*ME25","v":350},525,875,{"$f":"NF25/1000*$MC25","v":2.4499999999999997},{"$f":"NG25/1000*$MC25","v":3.6750000000000003},{"$f":"NH25/1000*$MC25","v":6.125},{"$f":"(NA25-NH25)","v":4878.0479452054797},{"$f":"MS25/1000*$MC25","v":9.072000000000001},{"$f":"MY25/1000*$MC25","v":3.7043999999999992},{"$f":"NA25/1000*$MC25","v":40.271335616438357},{"$f":"(NL25>0)*NL25/1000*$MC25","v":34.146335616438357},{"$f":"(MU25+MR25+MZ25)/1000*$MC25","v":50.708335616438355},{"$f":"MAX(1.2*$GA$15*($MQ$17-ML25)-MQ25,0)","v":1295.9999999999998},{"$f":"NG25/1000*$MC25","v":3.6750000000000003},{"$f":"(MU25+MR25+MZ25)","v":7244.0479452054797},{"$f":"MR25/1000*$MC25","v":20.567399999999999},{"$f":"(MR25-MQ25)/1000*$MC25","v":13.8348}]
[0.33105022831050229,-19.5,{"$f":"MAX($C$21*($C$19-B26)+B26,B26)","v":-19.5},16.600000000000001,{"$f":"D26/((A26-A25)/100*8760)","v":0.75454545454545463},3572.1,{"$f":"(A26-A25)/100*8760","v":22},3.5720999999999998,891,21,13.584745762711865,0,-19.5,-4.3773584905660368,-4.3773584905660368,15,1.1257861635220143,19.25,144.11864185344109,91.900124924614474,83.500744606518793,1.2323999999999999,4.7140473569745946,6.5508473569745949,7.0850479452054795,2.8673999999999999,0.53420058823088445,5.5890473569745946,0.64554794520547942,0.35,0.52500000000000002,0.875,0.96179999999999999,1.8368,0.58732876712328763,5.8219178082191785E-2,0,587.32876712328766,58.219178082191782,0,null,0.64554794520547942,0.64554794520547942,3.0691999999999999,null,null,null,null,null,null,null,null,null,null,null,null,null,null,null,null,null,null,null,null,null,null,12.921232876712327,1.2808219178082192,0,null,null,null,null,null,null,null,null,null,null,0.6919193130707374,0,0.80872396756167364,0,2.6901638271773205,0,0.8097811230748263,0,5.0005882308845573,5.0005882308845573,{"$f":"CL25","v":529.19999999999993},534.20058823088448,0.11001294107946026,534.20058823088448,null,null,null,null,null,null,null,null,null,null,null,null,null,null,null,null,null,null,null,null,null,null,null,null,null,null,null,null,null,null,null,null,null,null,null,null,null,null,null,null,null,null,null,null,null,null,null,null,null,null,null,null,null,null,null,null,null,null,null,null,null,null,null,null,null,null,null,null,null,null,null,null,null,null,null,null,null,null,null,null,null,null,{"$f":"FT25","v":2.5},{"$f":"FU25","v":350},525,875,22,2.5,350,525,875,{"$f":"GC25","v":0.56785714285714284},21,13.584745762711865,0,-19.5,-4.3773584905660368,9.3805031446540905,15,0,961.8,2867.4,357.39999999999981,1548.2000000000003,3572.1,534.20058823088448,5120.3,1,534.20058823088448,645.54794520547944,5589.0473569745945,875,{"$f":"MIN(1.2*$GA$14*(GD26-GK26),FV26)","v":525},350,350,350,525,875,7.6999999999999993,11.55,19.25,4714.0473569745945,7.8627999999999965,11.752412941079458,122.95904185344108,103.70904185344108,155.87105479452055,1232.3999999999999,11.55,null,63.082799999999999,41.923200000000001,null,null,null,{"$f":"HU25","v":2.5},350,525,875,22,2.5,0,0,0,{"$f":"ID25","v":0.56785714285714284},21,-19.5,0,3.8773584905660385,0,3.8773584905660385,15,{"$f":"IL25","v":0},0,1486.8,2867.4,707.39999999999986,673.20000000000027,3572.1,534.20058823088448,4245.3,1,534.20058823088448,645.54794520547944,5064.0473569745945,875,0,350,0,0,0,0,0,0,0,5064.0473569745945,15.562799999999998,11.752412941079458,111.40904185344107,111.40904185344107,155.87105479452055,707.39999999999986,0,null,63.082799999999999,30.373200000000001,null,null,null,{"$f":"JW25","v":2.5},350,525,875,22,2.5,0,0,0,{"$f":"KF25","v":0.56785714285714284},21,-19.5,0,3.8773584905660385,0,3.8773584905660385,15,{"$f":"KN25","v":0},0,1486.8,2867.4,707.39999999999986,673.20000000000027,3572.1,534.20058823088448,4245.3,1,534.20058823088448,645.54794520547944,5064.0473569745945,875,0,350,0,0,0,0,0,0,0,5064.0473569745945,15.562799999999998,11.752412941079458,111.40904185344107,111.40904185344107,155.87105479452055,707.39999999999986,0,null,63.082799999999999,30.373200000000001,null,null,null,{"$f":"LY25","v":2.5},350,525,875,22,2.5,350,525,875,{"$f":"MH25","v":0.56785714285714284},21,13.584745762711865,0,-19.5,-4.3773584905660368,-4.3773584905660368,15,0,961.8,2867.4,1232.3999999999999,673.20000000000027,3572.1,534.20058823088448,4245.3,1,534.20058823088448,645.54794520547944,5589.0473569745945,875,525,350,350,350,525,875,7.6999999999999993,11.55,19.25,4714.0473569745945,27.1128,11.752412941079458,122.95904185344108,103.70904185344108,155.87105479452055,1232.3999999999999,11.55,7085.0479452054797,63.082799999999999,41.923200000000001]
[0.55936073059360725,-18.5,-18.5,233.6,11.680000000000001,3483.9,{"$f":"(A27-A26)/100*8760","v":19.999999999999996},3.4839000000000002,789.99999999999989,21,13.584745762711865,0,-18.5,-3.3773584905660368,-3.3773584905660368,15,2.1257861635220143,17.499999999999996,126.3888249862685,90.400124924614474,80.862283794236262,1.1688000000000001,4.482641249313426,6.3194412493134262,6.9260479452054797,2.7965999999999998,0.60660669589205396,5.357641249313426,0.64554794520547942,0.35,0.52500000000000002,0.875,0.96179999999999999,1.8368,0.58732876712328763,5.8219178082191785E-2,0,587.32876712328766,58.219178082191782,0,null,0.64554794520547942,0.64554794520547942,3.0056000000000003,null,null,null,null,null,null,null,null,null,null,null,null,null,null,null,null,null,null,null,null,null,null,11.74657534246575,1.1643835616438354,0,null,null,null,null,null,null,null,null,null,null,10.710577511244379,0,12.518657271364319,0,41.642439580209903,0,12.535021529235387,0,{"$f":"SUM(CB27:CI27)","v":77.406695892053989},77.406695892053989,529.19999999999993,606.60669589205395,{"$f":"CJ27*G27/1000","v":1.5481339178410793},606.60669589205395,null,null,null,null,null,null,null,null,null,null,null,null,null,null,null,null,null,null,null,null,null,null,null,null,null,null,null,null,null,null,null,null,null,null,null,null,null,null,null,null,null,null,null,null,null,null,null,null,null,null,null,null,null,null,null,null,null,null,null,null,null,null,null,null,null,null,null,null,null,null,null,null,null,null,null,null,null,null,null,null,null,null,2.5,350,525,875,19.999999999999996,2.5,350,525,875,0.56785714285714284,21,13.584745762711865,0,-18.5,-3.3773584905660368,10.380503144654091,15,0,961.8,2796.6,293.79999999999984,1541,3483.9,606.60669589205395,5024.8999999999996,1,606.60669589205395,645.54794520547944,5357.6412493134258,875,525,350,350,350,525,875,6.9999999999999982,10.499999999999998,17.499999999999996,4482.6412493134258,5.8759999999999959,12.132133917841077,107.1528249862685,89.652824986268499,138.52095890410956,1168.8,10.499999999999998,null,55.931999999999988,36.695999999999991,null,null,null,2.5,350,525,875,19.999999999999996,2.5,0,0,0,0.56785714285714284,21,-18.5,0,4.8773584905660385,0,4.8773584905660385,15,0,0,1486.8,2796.6,643.79999999999984,666.00000000000011,3483.9,606.60669589205395,4149.9000000000005,1,606.60669589205395,645.54794520547944,4832.6412493134258,875,0,350,0,0,0,0,0,0,0,4832.6412493134258,12.875999999999994,12.132133917841077,96.652824986268499,96.652824986268499,138.52095890410956,643.79999999999995,0,null,55.931999999999988,26.195999999999991,null,null,null,{"$f":"JW26","v":2.5},350,525,875,19.999999999999996,2.5,0,0,0,{"$f":"KF26","v":0.56785714285714284},21,-18.5,0,4.8773584905660385,0,4.8773584905660385,15,0,0,1486.8,2796.6,643.79999999999984,666.00000000000011,3483.9,606.60669589205395,4149.9000000000005,1,606.60669589205395,645.54794520547944,4832.6412493134258,875,0,350,0,0,0,0,0,0,0,4832.6412493134258,12.875999999999994,12.132133917841077,96.652824986268499,96.652824986268499,138.52095890410956,643.79999999999995,0,null,55.931999999999988,26.195999999999991,null,null,null,2.5,350,525,875,19.999999999999996,2.5,350,525,875,0.56785714285714284,21,13.584745762711865,0,-18.5,-3.3773584905660368,-3.3773584905660368,15,0,961.8,2796.6,1168.8,666,3483.9,606.60669589205395,4149.8999999999996,1,606.60669589205395,645.54794520547944,5357.6412493134258,875,525,350,350,350,525,875,6.9999999999999982,10.499999999999998,17.499999999999996,4482.6412493134258,23.375999999999998,12.132133917841077,107.1528249862685,89.652824986268499,138.52095890410956,1168.8,10.499999999999998,6926.0479452054797,55.931999999999988,36.695999999999991]
[0.83333333333333337,-17.5,-17.5,606.20000000000005,25.258333333333329,3395.7000000000003,{"$f":"(A28-A27)/100*8760","v":24.000000000000007},3.3957000000000002,924.00000000000023,21,13.584745762711865,0,-17.5,-2.3773584905660368,-2.3773584905660368,15,3.1257861635220143,21.000000000000007,145.69089014984908,88.90012492461446,77.947386104460861,1.1052,4.2336537562437098,6.07045375624371,6.767047945205479,2.7257999999999996,0.69659418896176906,5.1086537562437107,0.64554794520547942,0.35,0.52500000000000002,0.875,0.96179999999999999,1.8368,0.58732876712328763,5.8219178082191785E-2,0,587.32876712328766,58.219178082191782,0,null,0.64554794520547942,0.64554794520547942,2.9420000000000002,null,null,null,null,null,null,null,null,null,null,null,null,null,null,null,null,null,null,null,null,null,null,14.095890410958907,1.3972602739726032,0,null,null,null,null,null,null,null,null,null,null,23.161929535232375,0,27.071953616941521,0,90.052964017991002,0,27.107341791604195,0,167.39418896176909,167.39418896176909,529.19999999999993,696.59418896176908,{"$f":"CJ28*G28/1000","v":4.0174605350824599},696.59418896176908,null,null,null,null,null,null,null,null,null,null,null,null,null,null,null,null,null,null,null,null,null,null,null,null,null,null,null,null,null,null,null,null,null,null,null,null,null,null,null,null,null,null,null,null,null,null,null,null,null,null,null,null,null,null,null,null,null,null,null,null,null,null,null,null,null,null,null,null,null,null,null,null,null,null,null,null,null,null,null,null,null,null,2.5,350,525,875,24.000000000000007,2.5,350,525,875,0.56785714285714284,21,13.584745762711865,0,-17.5,-2.3773584905660368,11.380503144654091,15,0,961.8,2725.7999999999997,230.19999999999982,1533.8,3395.7000000000003,696.59418896176908,4929.5,1,696.59418896176908,645.54794520547944,5108.6537562437106,875,525,350,350,350,525,875,8.4000000000000021,12.600000000000005,21.000000000000007,4233.6537562437106,5.5247999999999973,16.718260535082461,122.60769014984909,101.60769014984909,162.40915068493157,1105.2,12.600000000000005,null,65.419200000000004,42.336000000000006,null,null,null,2.5,350,525,875,24.000000000000007,2.5,0,0,0,0.56785714285714284,21,-17.5,0,5.8773584905660385,0,5.8773584905660385,15,0,0,1486.8,2725.7999999999997,580.19999999999993,658.79999999999984,3395.7000000000003,696.59418896176908,4054.5,1,696.59418896176908,645.54794520547944,4583.6537562437106,875,0,350,0,0,0,0,0,0,0,4583.6537562437106,13.924800000000003,16.718260535082461,110.00769014984908,110.00769014984908,162.40915068493157,580.20000000000005,0,null,65.419200000000004,29.736000000000004,null,null,null,{"$f":"JW27","v":2.5},350,525,875,24.000000000000007,2.5,0,0,0,{"$f":"KF27","v":0.56785714285714284},21,-17.5,0,5.8773584905660385,0,5.8773584905660385,15,0,0,1486.8,2725.7999999999997,580.19999999999993,658.79999999999984,3395.7000000000003,696.59418896176908,4054.5,1,696.59418896176908,645.54794520547944,4583.6537562437106,875,0,350,0,0,0,0,0,0,0,4583.6537562437106,13.924800000000003,16.718260535082461,110.00769014984908,110.00769014984908,162.40915068493157,580.20000000000005,0,null,65.419200000000004,29.736000000000004,null,null,null,2.5,350,525,875,24.000000000000007,2.5,350,525,875,0.56785714285714284,21,13.584745762711865,0,-17.5,-2.3773584905660368,-2.3773584905660368,15,0,961.8,2725.7999999999997,1105.2,658.79999999999973,3395.7000000000003,696.59418896176908,4054.5,1,696.59418896176908,645.54794520547944,5108.6537562437106,875,525,350,350,350,525,875,8.4000000000000021,12.600000000000005,21.000000000000007,4233.6537562437106,26.524800000000006,16.718260535082461,122.60769014984909,101.60769014984909,162.40915068493157,1105.2,12.600000000000005,6767.0479452054797,65.419200000000004,42.336000000000006]
[1.1986301369863013,-16.5,-16.5,1735,54.218750000000021,{"$f":"$F$21*(J29-B29)","v":3307.5},31.999999999999989,3.3075000000000001,1199.9999999999995,21,13.584745762711865,0,-16.5,-1.3773584905660368,-1.3773584905660368,15,4.1257861635220143,27.999999999999989,183.02479371808954,87.400124924614474,73.429635278149391,1.0415999999999999,3.8827248036902997,5.7195248036902999,6.6080479452054801,2.6549999999999998,0.88852314151517997,4.7577248036902997,0.64554794520547942,0.35,0.52500000000000002,0.875,0.96179999999999999,1.8368,0.58732876712328763,5.8219178082191785E-2,0,587.32876712328766,58.219178082191782,0,null,0.64554794520547942,0.64554794520547942,2.8784000000000001,null,null,null,null,null,null,null,null,null,null,null,null,null,null,null,null,null,null,null,null,null,null,18.794520547945197,1.8630136986301364,0,null,null,null,null,null,null,null,null,null,null,49.718675037481269,0,58.11181069621442,0,193.30488193403303,0,58.187773847451304,0,359.32314151518,359.32314151518,529.19999999999993,888.52314151517999,{"$f":"CJ29*G29/1000","v":11.498340528485757},888.52314151517999,null,null,null,null,null,null,null,null,null,null,null,null,null,null,null,null,null,null,null,null,null,null,null,null,null,null,null,null,null,null,null,null,null,null,null,null,null,null,null,null,null,null,null,null,null,null,null,null,null,null,null,null,null,null,null,null,null,null,null,null,null,null,null,null,null,null,null,null,null,null,null,null,null,null,null,null,null,null,null,null,null,null,2.5,350,525,875,31.999999999999989,2.5,350,525,875,0.56785714285714284,21,13.584745762711865,0,-16.5,-1.3773584905660368,12.380503144654091,15,0,961.8,2655,166.59999999999982,1526.6000000000001,3307.5,888.52314151517999,4834.1000000000004,1,888.52314151517999,645.54794520547944,4757.7248036902993,875,525,350,350,350,525,875,11.199999999999996,16.799999999999994,27.999999999999989,3882.7248036902993,5.3311999999999928,28.432740528485748,152.24719371808953,124.24719371808953,211.45753424657528,1041.5999999999999,16.799999999999994,null,84.959999999999965,54.18239999999998,null,null,null,2.5,350,525,875,31.999999999999989,2.5,0,0,0,0.56785714285714284,21,-16.5,0,6.8773584905660385,0,6.8773584905660385,15,0,0,1486.8,2655,516.59999999999991,651.60000000000014,3307.5,888.52314151517999,3959.1000000000004,1,888.52314151517999,645.54794520547944,4232.7248036902993,875,0,350,0,0,0,0,0,0,0,4232.7248036902993,16.531199999999991,28.432740528485748,135.44719371808952,135.44719371808952,211.45753424657528,516.59999999999991,0,null,84.959999999999965,37.38239999999999,null,null,null,{"$f":"JW28","v":2.5},350,525,875,31.999999999999989,2.5,0,0,0,{"$f":"KF28","v":0.56785714285714284},21,-16.5,0,6.8773584905660385,0,6.8773584905660385,15,0,0,1486.8,2655,516.59999999999991,651.60000000000014,3307.5,888.52314151517999,3959.1000000000004,1,888.52314151517999,645.54794520547944,4232.7248036902993,875,0,350,0,0,0,0,0,0,0,4232.7248036902993,16.531199999999991,28.432740528485748,135.44719371808952,135.44719371808952,211.45753424657528,516.59999999999991,0,null,84.959999999999965,37.38239999999999,null,null,null,2.5,350,525,875,31.999999999999989,2.5,350,525,875,0.56785714285714284,21,13.584745762711865,0,-16.5,-1.3773584905660368,-1.3773584905660368,15,0,961.8,2655,1041.5999999999999,651.60000000000014,3307.5,888.52314151517999,3959.1000000000004,1,888.52314151517999,645.54794520547944,4757.7248036902993,875,525,350,350,350,525,875,11.199999999999996,16.799999999999994,27.999999999999989,3882.7248036902993,33.331199999999981,28.432740528485748,152.24719371808953,124.24719371808953,211.45753424657528,1041.5999999999999,16.799999999999994,6608.0479452054797,84.959999999999965,54.18239999999998]
[1.872146118721461,-15.5,-15.5,2486.7000000000003,42.147457627118655,3219.3,58.999999999999993,3.2193000000000001,2153.4999999999995,21,13.584745762711865,0,-15.5,-0.37735849056603676,-0.37735849056603676,15,5.1257861635220143,51.624999999999993,332.79095764770796,85.900124924614474,73.187495375681692,0.97799999999999987,3.8037247058933552,5.6405247058933554,6.4490479452054794,2.5841999999999996,0.80852323931212366,4.6787247058933561,0.64554794520547942,0.35,0.52500000000000002,0.875,0.96179999999999999,1.8368,0.58732876712328763,5.8219178082191785E-2,0,587.32876712328766,58.219178082191782,0,null,0.64554794520547942,0.64554794520547942,2.8148,null,null,null,null,null,null,null,null,null,null,null,null,null,null,null,null,null,null,null,null,null,null,34.652397260273965,3.4349315068493147,0,null,null,null,null,null,null,null,null,null,null,38.649281833659444,0,45.173765144969892,0,150.2673765151323,0,45.23281581836202,0,279.32323931212369,279.32323931212369,529.19999999999993,808.52323931212368,16.480071119415296,808.52323931212368,null,null,null,null,null,null,null,null,null,null,null,null,null,null,null,null,null,null,null,null,null,null,null,null,null,null,null,null,null,null,null,null,null,null,null,null,null,null,null,null,null,null,null,null,null,null,null,null,null,null,null,null,null,null,null,null,null,null,null,null,null,null,null,null,null,null,null,null,null,null,null,null,null,null,null,null,null,null,null,null,null,null,2.5,350,525,875,58.999999999999993,2.5,350,525,875,0.56785714285714284,21,13.584745762711865,0,-15.5,-0.37735849056603676,13.380503144654091,15,0,961.8,2584.1999999999998,102.99999999999983,1519.4,3219.3,808.52323931212368,4738.7000000000007,1,808.52323931212368,645.54794520547944,4678.7247058933563,875,525,350,350,350,525,875,20.649999999999995,30.974999999999998,51.624999999999993,3803.7247058933563,6.0769999999999893,47.702871119415292,276.04475764770797,224.419757647708,380.49382876712326,977.99999999999977,30.974999999999998,null,152.46779999999995,95.721599999999981,null,null,null,2.5,350,525,875,58.999999999999993,2.5,12.89571428571427,19.343571428571405,32.239285714285671,0.56785714285714284,21,-15.5,0.27321428571428541,7.5732142857142861,0,8.0801212938005396,15,0,0,1467.4564285714284,2584.1999999999998,440.10428571428565,676.63928571428573,3219.3,808.52323931212368,3895.9392857142857,1,808.52323931212368,645.54794520547944,4173.0682773219278,875,19.343571428571405,350,12.89571428571427,12.89571428571427,19.343571428571405,32.239285714285671,0.76084714285714183,1.1412707142857128,1.9021178571428543,4140.8289916076419,25.966152857142852,47.702871119415292,246.21102836199373,244.30891050485087,380.49382876712326,472.34357142857129,1.1412707142857128,null,152.46779999999995,65.887870714285711,null,null,null,{"$f":"JW29","v":2.5},350,525,875,58.999999999999993,2.5,12.89571428571427,19.343571428571405,32.239285714285671,{"$f":"KF29","v":0.56785714285714284},21,-15.5,0.27321428571428541,7.5732142857142861,0,7.5732142857142861,15,0,0,1467.4564285714284,2584.1999999999998,472.34357142857135,644.40000000000009,3219.3,808.52323931212368,3863.7000000000003,1,808.52323931212368,645.54794520547944,4173.0682773219278,875,19.343571428571405,350,12.89571428571427,12.89571428571427,19.343571428571405,32.239285714285671,0.76084714285714183,1.1412707142857128,1.9021178571428543,4140.8289916076419,27.868270714285707,47.702871119415292,246.21102836199373,244.30891050485087,380.49382876712326,472.34357142857129,1.1412707142857128,null,152.46779999999995,65.887870714285711,null,null,null,2.5,350,525,875,58.999999999999993,2.5,350,525,875,0.56785714285714284,21,13.584745762711865,0,-15.5,-0.37735849056603676,-0.37735849056603676,15,0,961.8,2584.1999999999998,977.99999999999989,644.4,3219.3,808.52323931212368,3863.7000000000003,1,808.52323931212368,645.54794520547944,4678.7247058933563,875,525,350,350,350,525,875,20.649999999999995,30.974999999999998,51.624999999999993,3803.7247058933563,57.701999999999984,47.702871119415292,276.04475764770797,224.419757647708,380.49382876712326,977.99999999999977,30.974999999999998,6449.0479452054797,152.46779999999995,95.721599999999981]
[2.7625570776255706,-14.5,-14.5,686.5,8.8012820512820511,3131.1,78,3.1311,2769,21,13.584745762711865,0,-14.5,0.62264150943396324,0.62264150943396324,15,6.1257861635220143,68.25,444.79650815668714,84.400124924614488,75.16225370034816,0.91439999999999988,3.8657193353421428,5.7025193353421431,6.2900479452054805,2.5134000000000003,0.58752860986333744,4.740719335342142,0.64554794520547942,0.35,0.52500000000000002,0.875,0.96179999999999999,1.8368,0.58732876712328763,5.8219178082191785E-2,0,587.32876712328766,58.219178082191782,0,null,0.64554794520547942,0.64554794520547942,2.7511999999999999,null,null,null,null,null,null,null,null,null,null,null,null,null,null,null,null,null,null,null,null,null,null,45.811643835616437,4.5410958904109595,0,null,null,null,null,null,null,null,null,null,null,8.0707888363510545,0,9.4332391736823897,0,31.379011648022143,0,9.4455702052819746,0,58.328609863337562,58.328609863337562,529.19999999999993,587.52860986333746,4.5496315693403293,587.52860986333746,null,null,null,null,null,null,null,null,null,null,null,null,null,null,null,null,null,null,null,null,null,null,null,null,null,null,null,null,null,null,null,null,null,null,null,null,null,null,null,null,null,null,null,null,null,null,null,null,null,null,null,null,null,null,null,null,null,null,null,null,null,null,null,null,null,null,null,null,null,null,null,null,null,null,null,null,null,null,null,null,null,null,2.5,350,525,875,78,2.5,350,525,875,0.56785714285714284,21,13.584745762711865,0,-14.5,0.62264150943396324,14.380503144654091,15,0,961.8,2513.4,39.399999999999842,1512.2000000000003,3131.1,587.52860986333746,4643.3,1,587.52860986333746,645.54794520547944,4740.7193353421417,875,525,350,350,350,525,875,27.299999999999997,40.950000000000003,68.25,3865.7193353421417,3.0731999999999879,45.82723156934032,369.77610815668709,301.52610815668703,490.6237397260274,914.39999999999986,40.950000000000003,null,196.04520000000002,121.02480000000001,null,null,null,2.5,350,525,875,78,2.5,39.69857142857142,59.547857142857126,99.246428571428552,0.56785714285714284,21,-14.5,0.84107142857142847,7.9410714285714299,1.1102230246251565E-16,9.5015498652291122,15,0,0,1427.2521428571429,2513.4,349.70142857142844,736.44642857142878,3131.1,587.52860986333746,3867.5464285714288,1,587.52860986333746,645.54794520547944,4275.2671924849992,875,59.547857142857133,350,39.69857142857142,39.69857142857142,59.547857142857126,99.246428571428552,3.0964885714285706,4.6447328571428557,7.7412214285714276,4176.0207639135706,27.276711428571417,45.82723156934032,333.4708410138299,325.72961958525855,490.6237397260274,448.94785714285695,4.6447328571428557,null,196.04520000000002,84.719532857142852,null,null,null,{"$f":"JW30","v":2.5},350,525,875,78,2.5,39.69857142857142,59.547857142857126,99.246428571428552,{"$f":"KF30","v":0.56785714285714284},21,-14.5,0.84107142857142847,7.9410714285714299,1.1102230246251565E-16,7.9410714285714299,15,0,0,1427.2521428571429,2513.4,448.947857142857,637.20000000000027,3131.1,587.52860986333746,3768.3,1,587.52860986333746,645.54794520547944,4275.2671924849992,875,59.547857142857133,350,39.69857142857142,39.69857142857142,59.547857142857126,99.246428571428552,3.0964885714285706,4.6447328571428557,7.7412214285714276,4176.0207639135706,35.017932857142846,45.82723156934032,333.4708410138299,325.72961958525855,490.6237397260274,448.94785714285695,4.6447328571428557,null,196.04520000000002,84.719532857142852,null,null,null,2.5,350,525,875,78,2.5,350,525,875,0.56785714285714284,21,13.584745762711865,0,-14.5,0.62264150943396324,0.62264150943396324,15,0,961.8,2513.4,914.39999999999986,637.20000000000027,3131.1,587.52860986333746,3768.3,1,587.52860986333746,645.54794520547944,4740.7193353421417,875,525,350,350,350,525,875,27.299999999999997,40.950000000000003,68.25,3865.7193353421417,71.323199999999986,45.82723156934032,369.77610815668709,301.52610815668703,490.6237397260274,914.39999999999986,40.950000000000003,6290.0479452054797,196.04520000000002,121.02480000000001]
[3.5502283105022832,-13.5,-13.5,983.20000000000016,14.249275362318841,3042.9,69.000000000000014,3.0428999999999999,2380.5000000000005,21,13.584745762711865,0,-13.5,1.6226415094339632,1.6226415094339632,15,7.1257861635220143,60.375000000000014,380.01156101018267,82.900124924614474,73.094558611380606,0.85079999999999989,3.6706139276838057,5.5074139276838059,6.1310479452054798,2.4426000000000001,0.6236340175216738,4.5456139276838057,0.64554794520547942,0.35,0.52500000000000002,0.875,0.96179999999999999,1.8368,0.58732876712328763,5.8219178082191785E-2,0,587.32876712328766,58.219178082191782,0,null,0.64554794520547942,0.64554794520547942,2.6875999999999998,null,null,null,null,null,null,null,null,null,null,null,null,null,null,null,null,null,null,null,null,null,null,40.525684931506852,4.0171232876712342,0,null,null,null,null,null,null,null,null,null,null,13.066606870477802,0,15.272413923473044,0,50.802618864480806,0,15.292377863242294,0,94.434017521673937,94.434017521673937,529.19999999999993,623.63401752167385,6.5159472089955033,623.63401752167385,null,null,null,null,null,null,null,null,null,null,null,null,null,null,null,null,null,null,null,null,null,null,null,null,null,null,null,null,null,null,null,null,null,null,null,null,null,null,null,null,null,null,null,null,null,null,null,null,null,null,null,null,null,null,null,null,null,null,null,null,null,null,null,null,null,null,null,null,null,null,null,null,null,null,null,null,null,null,null,null,null,null,2.5,350,525,875,69.000000000000014,2.5,350,525,875,0.56785714285714284,21,13.584745762711865,0,-13.5,1.6226415094339632,15.380503144654091,15.380503144654091,0,961.8,2442.6,0,1480.8,3042.9,623.63401752167385,4523.7,1,623.63401752167385,645.54794520547944,4545.6139276838057,875,525,350,350,350,525,875,24.150000000000002,36.225000000000009,60.375000000000014,3670.6139276838057,0,43.0307472089955,313.64736101018264,253.27236101018264,423.04230821917821,875.00000000000023,36.225000000000009,null,168.53940000000003,102.17520000000002,null,null,null,2.5,350,525,875,69.000000000000014,2.5,66.501428571428576,99.752142857142871,166.25357142857143,0.56785714285714284,21,-13.5,1.4089285714285715,8.3089285714285701,0,10.922978436657681,15,0,0,1387.0478571428571,2442.6,259.29857142857145,796.25357142857138,3042.9,623.63401752167385,3839.1535714285715,1,623.63401752167385,645.54794520547944,4120.3660705409493,875,99.752142857142857,350,66.501428571428576,66.501428571428576,99.752142857142871,166.25357142857143,4.5885985714285722,6.8828978571428596,11.471496428571433,3954.1124991123779,17.891601428571434,43.0307472089955,284.30525886732556,272.83376243875415,423.04230821917821,425.55214285714283,6.8828978571428596,null,168.53940000000003,72.833097857142874,null,null,null,{"$f":"JW31","v":2.5},350,525,875,69.000000000000014,2.5,66.501428571428576,99.752142857142871,166.25357142857143,{"$f":"KF31","v":0.56785714285714284},21,-13.5,1.4089285714285715,8.3089285714285701,0,8.3089285714285701,15,0,0,1387.0478571428571,2442.6,425.55214285714288,630,3042.9,623.63401752167385,3672.9,1,623.63401752167385,645.54794520547944,4120.3660705409493,875,99.752142857142857,350,66.501428571428576,66.501428571428576,99.752142857142871,166.25357142857143,4.5885985714285722,6.8828978571428596,11.471496428571433,3954.1124991123779,29.363097857142865,43.0307472089955,284.30525886732556,272.83376243875415,423.04230821917821,425.55214285714283,6.8828978571428596,null,168.53940000000003,72.833097857142874,null,null,null,2.5,350,525,875,69.000000000000014,2.5,350,525,875,0.56785714285714284,21,13.584745762711865,0,-13.5,1.6226415094339632,1.6226415094339632,15,0,961.8,2442.6,850.79999999999984,630.00000000000011,3042.9,623.63401752167385,3672.9,1,623.63401752167385,645.54794520547944,4545.6139276838057,875,525,350,350,350,525,875,24.150000000000002,36.225000000000009,60.375000000000014,3670.6139276838057,58.705200000000005,43.0307472089955,313.64736101018264,253.27236101018264,423.04230821917821,850.8,36.225000000000009,6131.0479452054797,168.53940000000003,102.17520000000002]
[4.3493150684931505,-12.5,-12.5,1307.4999999999998,18.678571428571431,2954.7000000000003,69.999999999999986,2.9547000000000003,2344.9999999999995,21,13.584745762711865,0,-12.5,2.6226415094339632,2.6226415094339632,15,8.1257861635220152,61.249999999999986,372.33418023297423,81.400124924614474,71.133014427891823,0.78719999999999979,3.4822597176139185,5.3190597176139187,5.97204794520548,2.3717999999999999,0.65298822759156128,4.3572597176139176,0.64554794520547942,0.35,0.52500000000000002,0.875,0.96179999999999999,1.8368,0.58732876712328763,5.8219178082191785E-2,0,587.32876712328766,58.219178082191782,0,null,0.64554794520547942,0.64554794520547942,2.6239999999999997,null,null,null,null,null,null,null,null,null,null,null,null,null,null,null,null,null,null,null,null,null,null,41.113013698630127,4.0753424657534243,0,null,null,null,null,null,null,null,null,null,null,17.128278003855215,0,20.019746064467768,0,66.594287856071972,0,20.045915667166419,0,123.78822759156137,123.78822759156135,529.19999999999993,652.98822759156133,8.6651759314092942,652.98822759156133,null,null,null,null,null,null,null,null,null,null,null,null,null,null,null,null,null,null,null,null,null,null,null,null,null,null,null,null,null,null,null,null,null,null,null,null,null,null,null,null,null,null,null,null,null,null,null,null,null,null,null,null,null,null,null,null,null,null,null,null,null,null,null,null,null,null,null,null,null,null,null,null,null,null,null,null,null,null,null,null,null,null,2.5,350,525,875,69.999999999999986,2.5,350,525,875,0.56785714285714284,21,13.584745762711865,0,-12.5,2.6226415094339632,16.380503144654092,16.380503144654092,0,961.8,2371.7999999999997,0,1409.9999999999998,2954.7000000000003,652.98822759156133,4364.7,1,652.98822759156133,645.54794520547944,4357.2597176139179,875,525,350,350,350,525,875,24.499999999999993,36.749999999999993,61.249999999999986,3482.2597176139179,0,45.709175931409277,305.00818023297415,243.75818023297421,418.04335616438351,875.00000000000023,36.749999999999993,null,166.02599999999995,98.69999999999996,null,null,null,2.5,350,525,875,69.999999999999986,2.5,93.304285714285712,139.95642857142857,233.26071428571427,0.56785714285714284,21,-12.5,1.9767857142857146,8.6767857142857139,2.2204460492503131E-16,12.344407008086254,15,0,0,1346.8435714285713,2371.7999999999997,168.89571428571423,856.0607142857142,2954.7000000000003,652.98822759156133,3810.7607142857146,1,652.98822759156133,645.54794520547944,3972.2161461853466,875,139.95642857142857,350,93.304285714285712,93.304285714285712,139.95642857142857,233.26071428571427,6.531299999999999,9.7969499999999972,16.328249999999997,3738.9554318996325,11.822699999999994,45.709175931409277,278.05513023297419,261.72688023297422,418.04335616438351,402.15642857142848,9.7969499999999972,null,166.02599999999995,71.74694999999997,null,null,null,{"$f":"JW32","v":2.5},350,525,875,69.999999999999986,2.5,93.304285714285712,139.95642857142857,233.26071428571427,{"$f":"KF32","v":0.56785714285714284},21,-12.5,1.9767857142857146,8.6767857142857139,2.2204460492503131E-16,8.6767857142857139,15,0,0,1346.8435714285713,2371.7999999999997,402.15642857142853,622.79999999999995,2954.7000000000003,652.98822759156133,3577.5,1,652.98822759156133,645.54794520547944,3972.2161461853466,875,139.95642857142857,350,93.304285714285712,93.304285714285712,139.95642857142857,233.26071428571427,6.531299999999999,9.7969499999999972,16.328249999999997,3738.9554318996325,28.150949999999991,45.709175931409277,278.05513023297419,261.72688023297422,418.04335616438351,402.15642857142848,9.7969499999999972,null,166.02599999999995,71.74694999999997,null,null,null,2.5,350,525,875,69.999999999999986,2.5,350,525,875,0.56785714285714284,21,13.584745762711865,0,-12.5,2.6226415094339632,2.6226415094339632,15,0,961.8,2371.7999999999997,787.19999999999982,622.79999999999995,2954.7000000000003,652.98822759156133,3577.5,1,652.98822759156133,645.54794520547944,4357.2597176139179,875,525,350,350,350,525,875,24.499999999999993,36.749999999999993,61.249999999999986,3482.2597176139179,55.103999999999971,45.709175931409277,305.00818023297415,243.75818023297421,418.04335616438351,787.19999999999982,36.749999999999993,5972.0479452054797,166.02599999999995,98.69999999999996]
[4.9315068493150687,-11.5,-11.5,765.70000000000016,15.013725490196073,2866.5,51.000000000000028,2.8664999999999998,1657.5000000000009,21,13.584745762711865,0,-11.5,3.6226415094339632,3.6226415094339632,15,9.1257861635220152,44.625000000000028,264.40173261604934,79.900124924614488,70.014900917514254,0.72359999999999991,3.3475476983539059,5.1843476983539061,5.8130479452054802,2.3010000000000002,0.62870024685157411,4.2225476983539059,0.64554794520547942,0.35,0.52500000000000002,0.875,0.96179999999999999,1.8368,0.58732876712328763,5.8219178082191785E-2,0,587.32876712328766,58.219178082191782,0,null,0.64554794520547942,0.64554794520547942,2.5604,null,null,null,null,null,null,null,null,null,null,null,null,null,null,null,null,null,null,null,null,null,null,29.953767123287687,2.9691780821917826,0,null,null,null,null,null,null,null,null,null,null,13.767608783843366,0,16.091753748125928,0,53.528095599259167,0,16.112788720345705,0,99.500246851574175,99.500246851574175,529.19999999999993,628.70024685157409,5.0745125894302854,628.70024685157409,null,null,null,null,null,null,null,null,null,null,null,null,null,null,null,null,null,null,null,null,null,null,null,null,null,null,null,null,null,null,null,null,null,null,null,null,null,null,null,null,null,null,null,null,null,null,null,null,null,null,null,null,null,null,null,null,null,null,null,null,null,null,null,null,null,null,null,null,null,null,null,null,null,null,null,null,null,null,null,null,null,null,2.5,350,525,875,51.000000000000028,2.5,350,525,875,0.56785714285714284,21,13.584745762711865,0,-11.5,3.6226415094339632,17.380503144654092,17.380503144654092,0,961.8,2301,0,1339.2,2866.5,628.70024685157409,4205.7,1,628.70024685157409,645.54794520547944,4222.5476983539056,875,525,350,350,350,525,875,17.850000000000009,26.775000000000016,44.625000000000028,3347.5476983539056,0,32.063712589430295,215.34993261604933,170.72493261604927,296.46544520547963,875.00000000000023,26.775000000000016,null,117.35100000000007,68.299200000000042,null,null,null,2.5,350,525,875,51.000000000000028,2.5,120.10714285714288,180.16071428571431,300.26785714285717,0.56785714285714284,21,-11.5,2.5446428571428577,9.0446428571428577,0,13.765835579514826,15,0,0,1306.6392857142857,2301,78.492857142857034,915.86785714285725,2866.5,628.70024685157409,3782.3678571428572,1,628.70024685157409,645.54794520547944,3877.7084126396203,875,180.16071428571431,350,120.10714285714288,120.10714285714288,180.16071428571431,300.26785714285717,6.1254642857142896,9.1881964285714357,15.313660714285723,3577.440555496763,4.0031357142857109,32.063712589430295,197.76312904462074,182.44946833033501,296.46544520547963,378.76071428571413,9.1881964285714357,null,117.35100000000007,50.712396428571459,null,null,null,{"$f":"JW33","v":2.5},350,525,875,51.000000000000028,2.5,120.10714285714288,180.16071428571431,300.26785714285717,{"$f":"KF33","v":0.56785714285714284},21,-11.5,2.5446428571428577,9.0446428571428577,0,9.0446428571428577,15,0,0,1306.6392857142857,2301,378.76071428571424,615.6,2866.5,628.70024685157409,3482.1,1,628.70024685157409,645.54794520547944,3877.7084126396203,875,180.16071428571431,350,120.10714285714288,120.10714285714288,180.16071428571431,300.26785714285717,6.1254642857142896,9.1881964285714357,15.313660714285723,3577.440555496763,19.316796428571436,32.063712589430295,197.76312904462074,182.44946833033501,296.46544520547963,378.76071428571413,9.1881964285714357,null,117.35100000000007,50.712396428571459,null,null,null,2.5,350,525,875,51.000000000000028,2.5,350,525,875,0.56785714285714284,21,13.584745762711865,0,-11.5,3.6226415094339632,3.6226415094339632,15,0,961.8,2301,723.59999999999991,615.60000000000014,2866.5,628.70024685157409,3482.1000000000004,1,628.70024685157409,645.54794520547944,4222.5476983539056,875,525,350,350,350,525,875,17.850000000000009,26.775000000000016,44.625000000000028,3347.5476983539056,36.903600000000019,32.063712589430295,215.34993261604933,170.72493261604927,296.46544520547963,723.59999999999991,26.775000000000016,5813.0479452054797,117.35100000000007,68.299200000000042]
[5.4452054794520546,-10.5,-10.5,1332.5000000000002,29.611111111111139,2778.3,44.999999999999964,2.7783000000000002,1417.4999999999989,21,13.584745762711865,0,-10.5,4.6226415094339632,4.6226415094339632,15,10.125786163522015,39.374999999999972,221.78729946265719,78.400124924614474,66.993815325876099,0.65999999999999992,3.091806654725719,4.9286066547257192,5.6540479452054795,2.2302,0.72544129047976025,3.9668066547257195,0.64554794520547942,0.35,0.52500000000000002,0.875,0.96179999999999999,1.8368,0.58732876712328763,5.8219178082191785E-2,0,587.32876712328766,58.219178082191782,0,null,0.64554794520547942,0.64554794520547942,2.4967999999999999,null,null,null,null,null,null,null,null,null,null,null,null,null,null,null,null,null,null,null,null,null,null,26.429794520547922,2.6198630136986281,0,null,null,null,null,null,null,null,null,null,null,27.153433283358343,0,31.737273238380837,0,{"$f":"CF$23*$E35*CF$21*CF$20","v":105.57182408795613},0,31.778759870064999,0,196.24129047976029,196.24129047976029,529.19999999999993,725.44129047976026,8.8308580715892067,725.44129047976026,null,null,null,null,null,null,null,null,null,null,null,null,null,null,null,null,null,null,null,null,null,null,null,null,null,null,null,null,null,null,null,null,null,null,null,null,null,null,null,null,null,null,null,null,null,null,null,null,null,null,null,null,null,null,null,null,null,null,null,null,null,null,null,null,null,null,null,null,null,null,null,null,null,null,null,null,null,null,null,null,null,null,2.5,350,525,875,44.999999999999964,2.5,350,525,875,0.56785714285714284,21,13.584745762711865,0,-10.5,4.6226415094339632,18.380503144654092,18.380503144654092,0,961.8,2230.1999999999998,0,1268.3999999999999,2778.3,725.44129047976026,4046.7,1,725.44129047976026,645.54794520547944,3966.8066547257195,875,525,350,350,350,525,875,15.749999999999986,23.624999999999982,39.374999999999972,3091.8066547257195,0,32.644858071589184,178.50629946265724,139.13129946265727,254.43215753424639,875.00000000000023,23.624999999999982,null,100.35899999999992,57.077999999999953,null,null,null,2.5,350,525,875,44.999999999999964,2.5,146.91000000000003,220.36500000000004,367.27500000000009,0.56785714285714284,21,-10.5,3.1125000000000007,9.4124999999999979,0,15.187264150943395,15.187264150943395,0,0,1266.4349999999999,2230.1999999999998,0,963.76499999999987,2778.3,725.44129047976026,3742.0650000000001,1,725.44129047976026,645.54794520547944,3662.1716547257197,875,220.36500000000004,350,146.91000000000003,146.91000000000003,220.36500000000004,367.27500000000009,6.6109499999999954,9.9164249999999932,16.527374999999989,3294.8966547257196,0,32.644858071589184,164.79772446265724,148.27034946265726,254.43215753424639,355.36500000000001,9.9164249999999932,null,100.35899999999992,43.369424999999957,null,null,null,{"$f":"JW34","v":2.5},350,525,875,44.999999999999964,2.5,146.91000000000003,220.36500000000004,367.27500000000009,{"$f":"KF34","v":0.56785714285714284},21,-10.5,3.1125000000000007,9.4124999999999979,0,9.4124999999999979,15,0,0,1266.4349999999999,2230.1999999999998,355.36500000000012,608.39999999999975,2778.3,725.44129047976026,3386.7,1,725.44129047976026,645.54794520547944,3662.1716547257197,875,220.36500000000004,350,146.91000000000003,146.91000000000003,220.36500000000004,367.27500000000009,6.6109499999999954,9.9164249999999932,16.527374999999989,3294.8966547257196,15.991424999999992,32.644858071589184,164.79772446265724,148.27034946265726,254.43215753424639,355.36500000000001,9.9164249999999932,null,100.35899999999992,43.369424999999957,null,null,null,2.5,350,525,875,44.999999999999964,2.5,350,525,875,0.56785714285714284,21,13.584745762711865,0,-10.5,4.6226415094339632,4.6226415094339632,15,0,961.8,2230.1999999999998,659.99999999999989,608.4,2778.3,725.44129047976026,3386.7000000000003,1,725.44129047976026,645.54794520547944,3966.8066547257195,875,525,350,350,350,525,875,15.749999999999986,23.624999999999982,39.374999999999972,3091.8066547257195,29.699999999999974,32.644858071589184,178.50629946265724,139.13129946265727,254.43215753424639,660,23.624999999999982,5654.0479452054797,100.35899999999992,57.077999999999953]
[6.0502283105022832,-9.5,-9.5,1350.1999999999996,25.475471698113189,2690.1,53.000000000000021,2.6900999999999997,1616.5000000000007,21,13.584745762711865,0.47590799031477005,-9.5,5.0928571428571434,5.0928571428571434,15,10.596001796945195,46.375000000000021,254.24178006905396,76.900124924614474,65.924759721447089,0.63009428571428561,2.9939090039983203,4.7970147182840348,5.4950479452054797,2.1594000000000002,0.69803322692144476,3.8689090039983203,0.64554794520547942,0.35,0.52500000000000002,0.875,0.92810571428571431,1.8031057142857143,0.58732876712328763,5.8219178082191785E-2,0,587.32876712328766,58.219178082191782,0,null,0.64554794520547942,0.64554794520547942,2.4331999999999998,null,null,null,null,null,null,null,null,null,null,null,null,null,null,null,null,null,null,null,null,null,null,31.128424657534257,3.0856164383561659,0,null,null,null,null,null,null,null,null,null,null,23.361045741280286,0,27.30468313484765,0,90.827122514214537,0,27.34037553110236,0,168.83322692144483,168.83322692144483,529.19999999999993,698.03322692144479,8.9481610268365799,698.03322692144479,null,null,null,null,null,null,null,null,null,null,null,null,null,null,null,null,null,null,null,null,null,null,null,null,null,null,null,null,null,null,null,null,null,null,null,null,null,null,null,null,null,null,null,null,null,null,null,null,null,null,null,null,null,null,null,null,null,null,null,null,null,null,null,null,null,null,null,null,null,null,null,null,null,null,null,null,null,null,null,null,null,null,2.5,350,525,875,53.000000000000021,2.5,350,525,875,0.56785714285714284,21,13.584745762711865,0.47590799031477005,-9.5,5.0928571428571434,18.850718778077272,18.850718778077272,0,928.10571428571427,2159.4,0,1231.2942857142857,2690.1,698.03322692144479,3921.3942857142856,1,698.03322692144479,645.54794520547944,3868.9090039983203,875,525,350,350,350,525,875,18.550000000000008,27.825000000000014,46.375000000000021,2993.9090039983203,0,36.99576102683659,205.05217721191104,158.67717721191104,291.23754109589055,875.00000000000011,27.825000000000014,null,114.44820000000006,65.25859714285717,null,null,null,2.5,350,525,875,53.000000000000021,2.5,173.71285714285716,260.56928571428574,434.2821428571429,0.56785714285714284,21,-9.5,3.6803571428571438,9.7803571428571416,4.4408920985006262E-16,16.60869272237197,16.60869272237197,0,0,1226.2307142857142,2159.4,0,933.16928571428593,2690.1,698.03322692144479,3623.2692857142856,1,698.03322692144479,645.54794520547944,3570.7840039983203,875,260.56928571428574,350,173.71285714285716,173.71285714285716,260.56928571428574,434.2821428571429,9.2067814285714338,13.81017214285715,23.016953571428584,3136.5018611411774,0,36.99576102683659,189.25155221191105,166.23459864048246,291.23754109589055,331.96928571428566,13.81017214285715,null,114.44820000000006,49.457972142857173,null,null,null,{"$f":"JW35","v":2.5},350,525,875,53.000000000000021,2.5,173.71285714285716,260.56928571428574,434.2821428571429,{"$f":"KF35","v":0.56785714285714284},21,-9.5,3.6803571428571438,9.7803571428571416,4.4408920985006262E-16,9.7803571428571416,15,0,0,1226.2307142857142,2159.4,331.96928571428577,601.20000000000016,2690.1,698.03322692144479,3291.3,1,698.03322692144479,645.54794520547944,3570.7840039983203,875,260.56928571428574,350,173.71285714285716,173.71285714285716,260.56928571428574,434.2821428571429,9.2067814285714338,13.81017214285715,23.016953571428584,3136.5018611411774,17.594372142857154,36.99576102683659,189.25155221191105,166.23459864048246,291.23754109589055,331.96928571428566,13.81017214285715,null,114.44820000000006,49.457972142857173,null,null,null,2.5,350,525,875,53.000000000000021,2.5,350,525,875,0.56785714285714284,21,13.584745762711865,0.47590799031477005,-9.5,5.0928571428571434,5.0928571428571434,15,0,928.10571428571427,2159.4,630.09428571428566,601.20000000000005,2690.1,698.03322692144479,3291.3,1,698.03322692144479,645.54794520547944,3868.9090039983203,875,525,350,350,350,525,875,18.550000000000008,27.825000000000014,46.375000000000021,2993.9090039983203,33.39499714285715,36.99576102683659,205.05217721191104,158.67717721191104,291.23754109589055,630.09428571428555,27.825000000000014,5495.0479452054797,114.44820000000006,65.25859714285717]
[7.0319634703196341,-8.5,-8.5,1307.4999999999998,15.20348837209303,2601.9,85.999999999999943,2.6019000000000001,2536.9999999999982,21,13.584745762711865,1.0437651331719131,-8.5,5.4607142857142854,5.4607142857142854,15,10.963858939802336,75.249999999999943,404.72374735626175,75.400124924614474,65.495127131099537,0.60669857142857142,2.9431886569665018,4.7060900855379302,5.3360479452054799,2.0886,0.62995785966754991,3.8181886569665013,0.64554794520547942,0.35,0.52500000000000002,0.875,0.88790142857142862,1.7629014285714286,0.58732876712328763,5.8219178082191785E-2,0,587.32876712328766,58.219178082191782,0,null,0.64554794520547942,0.64554794520547942,2.3696000000000002,null,null,null,null,null,null,null,null,null,null,null,null,null,null,null,null,null,null,null,null,null,null,50.510273972602704,5.0068493150684903,0,null,null,null,null,null,null,null,null,null,null,13.941621631044947,0,16.295142145497024,0,54.204652906105117,0,16.316442984902906,0,100.75785966754999,100.75785966754999,529.19999999999993,629.95785966754988,8.6651759314092942,629.95785966754988,null,null,null,null,null,null,null,null,null,null,null,null,null,null,null,null,null,null,null,null,null,null,null,null,null,null,null,null,null,null,null,null,null,null,null,null,null,null,null,null,null,null,null,null,null,null,null,null,null,null,null,null,null,null,null,null,null,null,null,null,null,null,null,null,null,null,null,null,null,null,null,null,null,null,null,null,null,null,null,null,null,null,2.5,350,525,875,85.999999999999943,2.5,350,525,875,0.56785714285714284,21,13.584745762711865,1.0437651331719131,-8.5,5.4607142857142854,19.218575920934413,19.218575920934413,0,887.9014285714286,2088.6,0,1200.6985714285713,2601.9,629.95785966754988,3802.5985714285716,1,629.95785966754988,645.54794520547944,3818.1886569665012,875,525,350,350,350,525,875,30.099999999999977,45.14999999999997,75.249999999999943,2943.1886569665012,0,54.176375931409254,328.3642244991189,253.11422449911896,458.90012328767097,875,45.14999999999997,null,179.61959999999988,103.26007714285707,null,null,null,2.5,350,525,875,85.999999999999943,2.5,200.51571428571432,300.77357142857147,501.28928571428582,0.56785714285714284,21,-8.5,4.2482142857142868,10.148214285714285,0,18.030121293800541,18.030121293800541,0,0,1186.0264285714284,2088.6,0,902.57357142857154,2601.9,629.95785966754988,3504.4735714285716,1,629.95785966754988,645.54794520547944,3520.0636569665012,875,300.77357142857147,350,200.51571428571432,200.51571428571432,300.77357142857147,501.28928571428582,17.24435142857142,25.86652714285713,43.11087857142855,3018.7743712522151,0,54.176375931409254,302.72547449911889,259.61459592769035,458.90012328767097,308.57357142857154,25.86652714285713,null,179.61959999999988,77.621327142857098,null,null,null,{"$f":"JW36","v":2.5},350,525,875,85.999999999999943,2.5,200.51571428571432,300.77357142857147,501.28928571428582,{"$f":"KF36","v":0.56785714285714284},21,-8.5,4.2482142857142868,10.148214285714285,0,10.148214285714285,15,0,0,1186.0264285714284,2088.6,308.57357142857143,594.00000000000011,2601.9,629.95785966754988,3195.9,1,629.95785966754988,645.54794520547944,3520.0636569665012,875,300.77357142857147,350,200.51571428571432,200.51571428571432,300.77357142857147,501.28928571428582,17.24435142857142,25.86652714285713,43.11087857142855,3018.7743712522151,26.537327142857126,54.176375931409254,302.72547449911889,259.61459592769035,458.90012328767097,308.57357142857154,25.86652714285713,null,179.61959999999988,77.621327142857098,null,null,null,2.5,350,525,875,85.999999999999943,2.5,350,525,875,0.56785714285714284,21,13.584745762711865,1.0437651331719131,-8.5,5.4607142857142854,5.4607142857142854,15,0,887.9014285714286,2088.6,606.69857142857143,593.99999999999989,2601.9,629.95785966754988,3195.9,1,629.95785966754988,645.54794520547944,3818.1886569665012,875,525,350,350,350,525,875,30.099999999999977,45.14999999999997,75.249999999999943,2943.1886569665012,52.17607714285711,54.176375931409254,328.3642244991189,253.11422449911896,458.90012328767097,606.69857142857131,45.14999999999997,5336.0479452054797,179.61959999999988,103.26007714285707]
[8.4589041095890405,-7.5,-7.5,3076.1000000000008,24.608800000000006,2513.7000000000003,125,2.5137000000000005,3562.5,21,13.584745762711865,1.6116222760290562,-7.5,5.8285714285714292,5.8285714285714292,15,11.331716082659479,109.375,560.59479989438819,73.900124924614474,63.015069169105445,0.58330285714285712,2.7620612562979621,4.4847583991551057,5.1770479452054801,2.0177999999999998,0.69228954605037474,3.6370612562979616,0.64554794520547942,0.35,0.52500000000000002,0.875,0.84769714285714282,1.7226971428571427,0.58732876712328763,5.8219178082191785E-2,0,587.32876712328766,58.219178082191782,0,null,0.64554794520547942,0.64554794520547942,2.306,null,null,null,null,null,null,null,null,null,null,null,null,null,null,null,null,null,null,null,null,null,null,73.416095890410958,7.2773972602739727,0,null,null,null,null,null,null,null,null,null,null,22.566306494752627,0,26.375781940029988,0,87.737197529235388,0,26.410260086356832,0,163.08954605037482,163.08954605037482,529.19999999999993,692.28954605037472,20.386193256296853,692.28954605037472,null,null,null,null,null,null,null,null,null,null,null,null,null,null,null,null,null,null,null,null,null,null,null,null,null,null,null,null,null,null,null,null,null,null,null,null,null,null,null,null,null,null,null,null,null,null,null,null,null,null,null,null,null,null,null,null,null,null,null,null,null,null,null,null,null,null,null,null,null,null,null,null,null,null,null,null,null,null,null,null,null,null,2.5,350,525,875,125,2.5,350,525,875,0.56785714285714284,21,13.584745762711865,1.6116222760290562,-7.5,5.8285714285714292,19.586433063791556,19.586433063791556,0,847.69714285714281,2017.8,0,1170.1028571428571,2513.7000000000003,692.28954605037472,3683.8028571428576,1,692.28954605037472,645.54794520547944,3637.0612562979618,875,525,350,350,350,525,875,43.75,65.625,109.375,2762.0612562979618,0,86.536193256296841,454.63265703724522,345.25765703724522,647.13099315068496,875,65.625,null,252.22499999999997,146.26285714285714,null,null,null,2.5,350,525,875,125,2.5,227.31857142857146,340.9778571428572,568.29642857142869,0.56785714285714284,21,-7.5,4.8160714285714299,10.516071428571426,0,19.451549865229111,19.451549865229111,0,0,1145.8221428571428,2017.8,0,871.97785714285715,2513.7000000000003,692.28954605037472,3385.6778571428576,1,692.28954605037472,645.54794520547944,3338.9362562979618,875,340.9778571428572,350,227.31857142857146,227.31857142857146,340.9778571428572,568.29642857142869,28.414821428571432,42.62223214285715,71.037053571428586,2770.639827726533,0,86.536193256296841,417.36703203724522,346.32997846581662,647.13099315068496,285.17785714285696,42.62223214285715,null,252.22499999999997,108.99723214285714,null,null,null,{"$f":"JW37","v":2.5},350,525,875,125,2.5,227.31857142857146,340.9778571428572,568.29642857142869,{"$f":"KF37","v":0.56785714285714284},21,-7.5,4.8160714285714299,10.516071428571426,0,10.516071428571426,15,0,0,1145.8221428571428,2017.8,285.17785714285731,586.79999999999984,2513.7000000000003,692.28954605037472,3100.5,1,692.28954605037472,645.54794520547944,3338.9362562979618,875,340.9778571428572,350,227.31857142857146,227.31857142857146,340.9778571428572,568.29642857142869,28.414821428571432,42.62223214285715,71.037053571428586,2770.639827726533,35.647232142857163,86.536193256296841,417.36703203724522,346.32997846581662,647.13099315068496,285.17785714285696,42.62223214285715,null,252.22499999999997,108.99723214285714,null,null,null,2.5,350,525,875,125,2.5,350,525,875,0.56785714285714284,21,13.584745762711865,1.6116222760290562,-7.5,5.8285714285714292,5.8285714285714292,15,0,847.69714285714281,2017.8,583.30285714285708,586.80000000000007,2513.7000000000003,692.28954605037472,3100.5000000000005,1,692.28954605037472,645.54794520547944,3637.0612562979618,875,525,350,350,350,525,875,43.75,65.625,109.375,2762.0612562979618,72.912857142857135,86.536193256296841,454.63265703724522,345.25765703724522,647.13099315068496,583.30285714285696,65.625,5177.0479452054797,252.22499999999997,146.26285714285714]
[10.114155251141552,-6.5,-6.5,4849.1000000000013,33.442068965517244,2425.5,145.00000000000003,2.4255,3987.5000000000009,21,13.584745762711865,2.1794794188861992,-6.5,6.1964285714285712,6.1964285714285712,15,11.699573225516623,126.87500000000003,618.74658141693874,72.400124924614488,60.594619542066653,0.55990714285714283,2.5847249457325816,4.2672178028754386,5.0180479452054803,1.9470000000000001,0.75083014233004175,3.4597249457325807,0.64554794520547942,0.35,0.52500000000000002,0.875,0.80749285714285712,1.682492857142857,0.58732876712328763,5.8219178082191785E-2,0,587.32876712328766,58.219178082191782,0,null,0.64554794520547942,0.64554794520547942,2.2423999999999999,null,null,null,null,null,null,null,null,null,null,null,null,null,null,null,null,null,null,null,null,null,null,85.162671232876718,8.4417808219178099,0,null,null,null,null,null,null,null,null,null,null,30.666427379413737,0,35.843304779506795,0,119.23025139843871,0,35.890158772682625,0,221.63014233004185,221.63014233004185,529.19999999999993,750.83014233004178,32.136370637856075,750.83014233004178,null,null,null,null,null,null,null,null,null,null,null,null,null,null,null,null,null,null,null,null,null,null,null,null,null,null,null,null,null,null,null,null,null,null,null,null,null,null,null,null,null,null,null,null,null,null,null,null,null,null,null,null,null,null,null,null,null,null,null,null,null,null,null,null,null,null,null,null,null,null,null,null,null,null,null,null,null,null,null,null,null,null,2.5,350,525,875,145.00000000000003,2.5,350,525,875,0.56785714285714284,21,13.584745762711865,2.1794794188861992,-6.5,6.1964285714285712,19.9542902066487,19.9542902066487,0,807.49285714285713,1947,0,1139.5071428571428,2425.5,750.83014233004178,3565.0071428571428,1,750.83014233004178,645.54794520547944,3459.7249457325806,875,525,350,350,350,525,875,50.750000000000007,76.125000000000014,126.87500000000003,2584.7249457325806,0,108.87037063785607,501.6601171312243,374.7851171312243,727.61695205479464,875.00000000000011,76.125000000000014,null,282.31500000000005,165.22853571428575,null,null,null,2.5,350,525,875,145.00000000000003,2.5,254.12142857142854,381.18214285714282,635.30357142857133,0.56785714285714284,21,-6.5,5.3839285714285712,10.883928571428573,0,20.872978436657682,20.872978436657682,0,0,1105.617857142857,1947,0,841.38214285714298,2425.5,750.83014233004178,3266.8821428571428,1,750.83014233004178,645.54794520547944,3161.5999457325806,875,381.18214285714282,350,254.12142857142854,254.12142857142854,381.18214285714282,635.30357142857133,36.84760714285715,55.271410714285715,92.11901785714285,2526.2963743040091,0,108.87037063785607,458.43199213122426,366.3129742740814,727.61695205479464,261.78214285714284,55.271410714285715,null,282.31500000000005,122.00041071428575,null,null,null,{"$f":"JW38","v":2.5},350,525,875,145.00000000000003,2.5,254.12142857142854,381.18214285714282,635.30357142857133,{"$f":"KF38","v":0.56785714285714284},21,-6.5,5.3839285714285712,10.883928571428573,0,10.883928571428573,15,0,0,1105.617857142857,1947,261.78214285714273,579.60000000000025,2425.5,750.83014233004178,3005.1000000000004,1,750.83014233004178,645.54794520547944,3161.5999457325806,875,381.18214285714282,350,254.12142857142854,254.12142857142854,381.18214285714282,635.30357142857133,36.84760714285715,55.271410714285715,92.11901785714285,2526.2963743040091,37.958410714285705,108.87037063785607,458.43199213122426,366.3129742740814,727.61695205479464,261.78214285714284,55.271410714285715,null,282.31500000000005,122.00041071428575,null,null,null,2.5,350,525,875,145.00000000000003,2.5,350,525,875,0.56785714285714284,21,13.584745762711865,2.1794794188861992,-6.5,6.1964285714285712,6.1964285714285712,15,0,807.49285714285713,1947,559.90714285714284,579.59999999999991,2425.5,750.83014233004178,3005.1,1,750.83014233004178,645.54794520547944,3459.7249457325806,875,525,350,350,350,525,875,50.750000000000007,76.125000000000014,126.87500000000003,2584.7249457325806,81.186535714285725,108.87037063785607,501.6601171312243,374.7851171312243,727.61695205479464,559.90714285714273,76.125000000000014,5018.0479452054797,282.31500000000005,165.22853571428575]
[11.997716894977168,-5.5,-5.5,5187.5999999999985,31.439999999999991,2337.3000000000002,165,2.3373000000000004,4372.5,21,13.584745762711865,2.7473365617433423,-5.5,6.5642857142857132,6.5642857142857132,15,12.067430368373763,144.375,680.04520414301214,70.900124924614474,59.303240341434361,0.53651142857142864,2.4791975142866529,4.1214860857152251,4.8590479452054796,1.8761999999999999,0.73756185949025477,3.3541975142866542,0.64554794520547942,0.35,0.52500000000000002,0.875,0.76728857142857132,1.6422885714285713,0.58732876712328763,5.8219178082191785E-2,0,587.32876712328766,58.219178082191782,0,null,0.64554794520547942,0.64554794520547942,2.1787999999999998,null,null,null,null,null,null,null,null,null,null,null,null,null,null,null,null,null,null,null,null,null,null,96.909246575342465,9.6061643835616444,0,null,null,null,null,null,null,null,null,null,null,28.830527136431773,0,33.697481559220378,0,112.09232023988002,0,33.74153055472263,0,208.3618594902548,208.3618594902548,529.19999999999993,737.56185949025473,34.379706815892042,737.56185949025473,null,null,null,null,null,null,null,null,null,null,null,null,null,null,null,null,null,null,null,null,null,null,null,null,null,null,null,null,null,null,null,null,null,null,null,null,null,null,null,null,null,null,null,null,null,null,null,null,null,null,null,null,null,null,null,null,null,null,null,null,null,null,null,null,null,null,null,null,null,null,null,null,null,null,null,null,null,null,null,null,null,null,2.5,350,525,875,165,2.5,350,525,875,0.56785714285714284,21,13.584745762711865,2.7473365617433423,-5.5,6.5642857142857132,20.32214734950584,20.32214734950584,0,767.28857142857134,1876.1999999999998,0,1108.9114285714286,2337.3000000000002,737.56185949025473,3446.2114285714288,1,737.56185949025473,645.54794520547944,3354.197514286654,875,525,350,350,350,525,875,57.749999999999993,86.625,144.375,2479.197514286654,0,121.69770681589203,553.442589857298,409.06758985729795,801.74291095890408,874.99999999999989,86.625,null,309.57299999999998,182.9703857142857,null,null,null,2.5,350,525,875,165,2.5,280.9242857142857,421.38642857142855,702.31071428571431,0.56785714285714284,21,-5.5,5.9517857142857142,11.251785714285713,0,22.294407008086253,22.294407008086253,0,0,1065.4135714285715,1876.1999999999998,0,810.78642857142836,2337.3000000000002,737.56185949025473,3148.0864285714288,1,737.56185949025473,645.54794520547944,3056.072514286654,875,421.38642857142855,350,280.9242857142857,280.9242857142857,421.38642857142855,702.31071428571431,46.352507142857135,69.52876071428571,115.88126785714287,2353.7618000009397,0,121.69770681589203,504.25196485729793,388.37069700015508,801.74291095890408,238.3864285714285,69.52876071428571,null,309.57299999999998,133.77976071428569,null,null,null,{"$f":"JW39","v":2.5},350,525,875,165,2.5,280.9242857142857,421.38642857142855,702.31071428571431,{"$f":"KF39","v":0.56785714285714284},21,-5.5,5.9517857142857142,11.251785714285713,0,11.251785714285713,15,0,0,1065.4135714285715,1876.1999999999998,238.38642857142861,572.39999999999975,2337.3000000000002,737.56185949025473,2909.7,1,737.56185949025473,645.54794520547944,3056.072514286654,875,421.38642857142855,350,280.9242857142857,280.9242857142857,421.38642857142855,702.31071428571431,46.352507142857135,69.52876071428571,115.88126785714287,2353.7618000009397,39.333760714285724,121.69770681589203,504.25196485729793,388.37069700015508,801.74291095890408,238.3864285714285,69.52876071428571,null,309.57299999999998,133.77976071428569,null,null,null,2.5,350,525,875,165,2.5,350,525,875,0.56785714285714284,21,13.584745762711865,2.7473365617433423,-5.5,6.5642857142857132,6.5642857142857132,15,0,767.28857142857134,1876.1999999999998,536.51142857142861,572.4,2337.3000000000002,737.56185949025473,2909.7000000000003,1,737.56185949025473,645.54794520547944,3354.197514286654,875,525,350,350,350,525,875,57.749999999999993,86.625,144.375,2479.197514286654,88.524385714285728,121.69770681589203,553.442589857298,409.06758985729795,801.74291095890408,536.51142857142861,86.625,4859.0479452054797,309.57299999999998,182.9703857142857]
[14.121004566210047,-4.5,-4.5,4777.5000000000018,25.685483870967733,2249.1,186.00000000000014,2.2490999999999999,4743.0000000000036,21,13.584745762711865,3.3151937046004853,-4.5,6.9321428571428569,6.9321428571428569,15,12.435287511230907,162.75000000000011,744.11586081983899,69.400124924614474,58.402875906187738,0.51311571428571423,2.3985386219192542,4.0006229076335398,4.7000479452054797,1.8053999999999999,0.69942503757193975,3.2735386219192542,0.64554794520547942,0.35,0.52500000000000002,0.875,0.72708428571428563,1.6020842857142856,0.58732876712328763,5.8219178082191785E-2,0,587.32876712328766,58.219178082191782,0,null,0.64554794520547942,0.64554794520547942,2.1151999999999997,null,null,null,null,null,null,null,null,null,null,null,null,null,null,null,null,null,null,null,null,null,null,109.24315068493158,10.82876712328768,0,null,null,null,null,null,null,null,null,null,null,23.553627218648728,0,27.529774779948724,0,91.575874159694308,0,27.565761413648008,0,170.22503757193977,170.22503757193977,529.19999999999993,699.4250375719397,31.661856988380819,699.4250375719397,null,null,null,null,null,null,null,null,null,null,null,null,null,null,null,null,null,null,null,null,null,null,null,null,null,null,null,null,null,null,null,null,null,null,null,null,null,null,null,null,null,null,null,null,null,null,null,null,null,null,null,null,null,null,null,null,null,null,null,null,null,null,null,null,null,null,null,null,null,null,null,null,null,null,null,null,null,null,null,null,null,null,2.5,350,525,875,186.00000000000014,2.5,350,525,875,0.56785714285714284,21,13.584745762711865,3.3151937046004853,-4.5,6.9321428571428569,20.690004492362984,20.690004492362984,0,727.08428571428567,1805.3999999999999,0,1078.3157142857142,2249.1,699.4250375719397,3327.4157142857139,1,699.4250375719397,645.54794520547944,3273.5386219192542,875,525,350,350,350,525,875,65.100000000000051,97.650000000000077,162.75000000000011,2398.5386219192542,0,130.09305698838088,608.87818367698173,446.12818367698162,874.20891780821989,875,97.650000000000077,null,335.80440000000021,200.56672285714302,null,null,null,2.5,350,525,875,186.00000000000014,2.5,307.72714285714284,461.59071428571428,769.31785714285706,0.56785714285714284,21,-4.5,6.5196428571428573,11.619642857142857,0,23.715835579514824,23.715835579514824,0,0,1025.2092857142857,1805.3999999999999,0,{"$f":"IO41-IN41-IP41","v":780.19071428571419},2249.1,699.4250375719397,3029.2907142857139,1,699.4250375719397,645.54794520547944,2975.4136219192542,875,461.59071428571428,350,307.72714285714284,307.72714285714284,461.59071428571428,769.31785714285706,57.237248571428609,85.855872857142927,143.09312142857152,2206.0957647763971,0,130.09305698838088,553.42693367698178,410.3338122484102,874.20891780821989,214.99071428571415,85.855872857142927,null,335.80440000000021,145.11547285714295,null,null,null,{"$f":"JW40","v":2.5},350,525,875,186.00000000000014,2.5,307.72714285714284,461.59071428571428,769.31785714285706,{"$f":"KF40","v":0.56785714285714284},21,-4.5,6.5196428571428573,11.619642857142857,0,11.619642857142857,15,0,0,1025.2092857142857,1805.3999999999999,214.99071428571429,565.19999999999993,2249.1,699.4250375719397,2814.2999999999997,1,699.4250375719397,645.54794520547944,2975.4136219192542,875,461.59071428571428,350,307.72714285714284,307.72714285714284,461.59071428571428,769.31785714285706,57.237248571428609,85.855872857142927,143.09312142857152,2206.0957647763971,39.988272857142888,130.09305698838088,553.42693367698178,410.3338122484102,874.20891780821989,214.99071428571415,85.855872857142927,null,335.80440000000021,145.11547285714295,null,null,null,2.5,350,525,875,186.00000000000014,2.5,350,525,875,0.56785714285714284,21,13.584745762711865,3.3151937046004853,-4.5,6.9321428571428569,6.9321428571428569,15,0,727.08428571428567,1805.3999999999999,513.11571428571426,565.19999999999993,2249.1,699.4250375719397,2814.2999999999997,1,699.4250375719397,645.54794520547944,3273.5386219192542,875,525,350,350,350,525,875,65.100000000000051,97.650000000000077,162.75000000000011,2398.5386219192542,95.439522857142919,130.09305698838088,608.87818367698173,446.12818367698162,874.20891780821989,513.11571428571415,97.650000000000077,4700.0479452054797,335.80440000000021,200.56672285714302]
[16.289954337899541,-3.5,-3.5,5603.7999999999993,29.493684210526361,2160.9,189.99999999999969,2.1609000000000003,4654.9999999999927,21,13.584745762711865,3.8830508474576284,-3.5,7.2999999999999989,7.2999999999999989,15,12.803144654088051,166.24999999999972,725.1131265034328,67.90012492461446,56.506051514683385,0.48972000000000004,2.2545048763338631,3.816384876333863,4.5410479452054799,1.7345999999999999,0.72466306887161702,3.1295048763338627,0.64554794520547942,0.35,0.52500000000000002,0.875,0.68687999999999994,1.5618799999999999,0.58732876712328763,5.8219178082191785E-2,0,587.32876712328766,58.219178082191782,0,null,0.64554794520547942,0.64554794520547942,2.0516000000000001,null,null,null,null,null,null,null,null,null,null,null,null,null,null,null,null,null,null,null,null,null,null,111.59246575342446,11.061643835616421,0,null,null,null,null,null,null,null,null,null,null,27.045752639469775,0,31.611414751834655,0,105.1531646176913,0,31.652736862621371,0,195.46306887161708,195.46306887161708,529.19999999999993,724.66306887161704,37.137983085607189,724.66306887161704,null,null,null,null,null,null,null,null,null,null,null,null,null,null,null,null,null,null,null,null,null,null,null,null,null,null,null,null,null,null,null,null,null,null,null,null,null,null,null,null,null,null,null,null,null,null,null,null,null,null,null,null,null,null,null,null,null,null,null,null,null,null,null,null,null,null,null,null,null,null,null,null,null,null,null,null,null,null,null,null,null,null,2.5,350,525,875,189.99999999999969,2.5,350,525,875,0.56785714285714284,21,13.584745762711865,3.8830508474576284,-3.5,7.2999999999999989,21.057861635220128,21.057861635220128,0,686.87999999999988,1734.6,0,1047.72,2160.9,724.66306887161704,3208.62,1,724.66306887161704,645.54794520547944,3129.5048763338627,875,525,350,350,350,525,875,66.499999999999886,99.749999999999844,166.24999999999972,2254.5048763338627,0,137.68598308560701,594.6059265034329,428.35592650343318,862.79910958903974,875.00000000000023,99.749999999999844,null,329.57399999999944,199.06679999999966,null,null,null,{"$f":"HU41","v":2.5},350,525,875,189.99999999999969,2.5,334.53000000000003,501.79500000000007,836.32500000000005,{"$f":"ID41","v":0.56785714285714284},21,-3.5,7.0875000000000004,11.987499999999999,0,25.137264150943395,25.137264150943395,0,0,985.00499999999988,1734.6,0,749.59500000000003,2160.9,724.66306887161704,2910.4949999999999,1,724.66306887161704,645.54794520547944,2831.3798763338627,875,501.79500000000002,350,334.53000000000003,334.53000000000003,501.79500000000007,836.32500000000005,63.560699999999905,95.341049999999868,158.90174999999977,1995.0548763338627,0,137.68598308560701,537.96217650343306,379.06042650343329,862.79910958903974,191.59500000000003,95.341049999999868,null,329.57399999999944,142.42304999999976,null,null,null,{"$f":"JW41","v":2.5},350,525,875,189.99999999999969,2.5,334.53000000000003,501.79500000000007,836.32500000000005,{"$f":"KF41","v":0.56785714285714284},21,-3.5,7.0875000000000004,11.987499999999999,0,11.987499999999999,15,0,0,985.00499999999988,1734.6,191.59500000000006,558,2160.9,724.66306887161704,2718.9,1,724.66306887161704,645.54794520547944,2831.3798763338627,875,501.79500000000002,350,334.53000000000003,334.53000000000003,501.79500000000007,836.32500000000005,63.560699999999905,95.341049999999868,158.90174999999977,1995.0548763338627,36.403049999999951,137.68598308560701,537.96217650343306,379.06042650343329,862.79910958903974,191.59500000000003,95.341049999999868,null,329.57399999999944,142.42304999999976,null,null,null,{"$f":"LY41","v":2.5},350,525,875,189.99999999999969,2.5,350,525,875,{"$f":"MH41","v":0.56785714285714284},21,13.584745762711865,3.8830508474576284,-3.5,7.2999999999999989,7.2999999999999989,15,0,686.87999999999988,1734.6,489.72,558,2160.9,724.66306887161704,2718.9,1,724.66306887161704,645.54794520547944,3129.5048763338627,875,525,350,350,350,525,875,66.499999999999886,99.749999999999844,166.24999999999972,2254.5048763338627,93.046799999999848,137.68598308560701,594.6059265034329,428.35592650343318,862.79910958903974,489.72,99.749999999999844,4541.0479452054797,329.57399999999944,199.06679999999966]
[18.755707762557076,-2.5,-2.5,4354.8000000000029,20.161111111111115,2072.7000000000003,216.00000000000009,2.0727000000000002,5076.0000000000018,21,13.584745762711865,4.4509079903147697,-2.5,7.6678571428571445,7.6678571428571445,15,13.171001796945195,189.00000000000009,803.35465280216511,66.400124924614474,55.97852993260576,0.46632428571428558,2.1975587894280117,3.719234503713726,4.3820479452054801,1.6637999999999999,0.66281344149175403,3.0725587894280117,0.64554794520547942,0.35,0.52500000000000002,0.875,0.64667571428571435,1.5216757142857142,0.58732876712328763,5.8219178082191785E-2,0,587.32876712328766,58.219178082191782,0,null,0.64554794520547942,0.64554794520547942,1.9879999999999998,null,null,null,null,null,null,null,null,null,null,null,null,null,null,null,null,null,null,null,null,null,null,126.86301369863018,12.57534246575343,0,null,null,null,null,null,null,null,null,null,null,18.48776911544228,0,21.608736319340334,0,71.87995302348827,0,21.636983033483265,0,133.61344149175414,133.61344149175414,529.19999999999993,662.81344149175402,28.860503362218907,662.81344149175402,null,null,null,null,null,null,null,null,null,null,null,null,null,null,null,null,null,null,null,null,null,null,null,null,null,null,null,null,null,null,null,null,null,null,null,null,null,null,null,null,null,null,null,null,null,null,null,null,null,null,null,null,null,null,null,null,null,null,null,null,null,null,null,null,null,null,null,null,null,null,null,null,null,null,null,null,null,null,null,null,null,null,2.5,350,525,875,216.00000000000009,2.5,350,525,875,0.56785714285714284,21,13.584745762711865,4.4509079903147697,-2.5,7.6678571428571445,21.425718778077272,21.425718778077272,0,646.67571428571432,1663.8,0,1017.1242857142856,2072.7000000000003,662.81344149175402,3089.8242857142859,1,662.81344149175402,645.54794520547944,3072.5587894280116,875,525,350,350,350,525,875,75.600000000000023,113.40000000000005,189.00000000000009,2197.5587894280116,0,143.16770336221893,663.67269851645085,474.67269851645074,946.52235616438384,875,113.40000000000005,null,359.38080000000014,219.6988457142858,null,null,null,2.5,350,525,875,216.00000000000009,2.5,350,525,875,0.56785714285714284,21,-2.5,7.6553571428571434,12.355357142857143,0.2401029055690076,26.113218778077268,26.113218778077268,0,0,944.80071428571421,1663.8,0,718.99928571428575,2072.7000000000003,662.81344149175402,2791.6992857142859,1,662.81344149175402,645.54794520547944,2774.4337894280116,875,525,350,350,350,525,875,75.600000000000023,113.40000000000005,189.00000000000009,1899.4337894280116,0,143.16770336221893,599.27769851645076,410.27769851645064,946.52235616438384,168.19928571428579,113.40000000000005,null,359.38080000000014,155.30384571428579,null,null,null,{"$f":"JW42","v":2.5},350,525,875,216.00000000000009,2.5,350,525,875,{"$f":"KF42","v":0.56785714285714284},21,-2.5,7.6553571428571434,12.355357142857143,0.2401029055690076,12.355357142857143,15,0,0,944.80071428571421,1663.8,168.19928571428571,550.80000000000007,2072.7000000000003,662.81344149175402,2623.5000000000005,1,662.81344149175402,645.54794520547944,2774.4337894280116,875,525,350,350,350,525,875,75.600000000000023,113.40000000000005,189.00000000000009,1899.4337894280116,36.331045714285729,143.16770336221893,599.27769851645076,410.27769851645064,946.52235616438384,168.19928571428579,113.40000000000005,null,359.38080000000014,155.30384571428579,null,null,null,2.5,350,525,875,216.00000000000009,2.5,350,525,875,0.56785714285714284,21,13.584745762711865,4.4509079903147697,-2.5,7.6678571428571445,7.6678571428571445,15,0,646.67571428571432,1663.8,466.32428571428557,550.80000000000007,2072.7000000000003,662.81344149175402,2623.5000000000005,1,662.81344149175402,645.54794520547944,3072.5587894280116,875,525,350,350,350,525,875,75.600000000000023,113.40000000000005,189.00000000000009,2197.5587894280116,100.72604571428573,143.16770336221893,663.67269851645085,474.67269851645074,946.52235616438384,466.32428571428568,113.40000000000005,4382.0479452054797,359.38080000000014,219.6988457142858]
[21.44977168949772,-1.5,-1.5,7134.0999999999985,30.22923728813554,1984.5,236.00000000000037,1.9844999999999999,5310.0000000000082,21,13.584745762711865,5.0187651331719128,-1.5,8.0357142857142865,8.0357142857142865,15,13.538858939802338,206.50000000000031,824.46839681819472,64.90012492461446,53.429404968699593,0.44292857142857134,2.0120387274378655,3.493510156009294,4.2230479452054794,1.593,0.72953778919618539,2.8870387274378659,0.64554794520547942,0.35,0.52500000000000002,0.875,0.60647142857142866,1.4814714285714286,0.58732876712328763,5.8219178082191785E-2,0,587.32876712328766,58.219178082191782,0,null,0.64554794520547942,0.64554794520547942,1.9243999999999999,null,null,null,null,null,null,null,null,null,null,null,null,null,null,null,null,null,null,null,null,null,null,138.60958904109609,13.739726027397282,0,null,null,null,null,null,null,null,null,null,null,27.720255914415624,0,32.399782635694805,0,107.77561535334009,0,32.442135292734932,0,200.33778919618544,200.33778919618544,529.19999999999993,{"$f":"CK44+CL44","v":729.53778919618537},47.279718250299837,729.53778919618537,null,null,null,null,null,null,null,null,null,null,null,null,null,null,null,null,null,null,null,null,null,null,null,null,null,null,null,null,null,null,null,null,null,null,null,null,null,null,null,null,null,null,null,null,null,null,null,null,null,null,null,null,null,null,null,null,null,null,null,null,null,null,null,null,null,null,null,null,null,null,null,null,null,null,null,null,null,null,null,null,null,null,2.5,350,525,875,236.00000000000037,2.5,350,525,875,0.56785714285714284,21,13.584745762711865,5.0187651331719128,-1.5,8.0357142857142865,21.793575920934416,21.793575920934416,0,606.47142857142865,1593,0,986.52857142857135,1984.5,729.53778919618537,2971.0285714285715,1,729.53778919618537,645.54794520547944,2887.0387274378659,875,525,350,350,350,525,875,82.600000000000122,123.9000000000002,206.50000000000031,2012.0387274378659,0,172.17091825030002,681.34113967533744,474.8411396753371,996.63931506849474,875.00000000000011,123.9000000000002,null,375.9480000000006,232.82074285714319,null,null,null,2.5,350,525,875,236.00000000000037,2.5,350,525,875,0.56785714285714284,21,-1.5,8.2232142857142865,12.723214285714285,0.80796004842615066,26.481075920934412,26.481075920934412,0,0,904.59642857142853,1593,0,688.40357142857147,1984.5,729.53778919618537,2672.9035714285715,1,729.53778919618537,645.54794520547944,2588.9137274378659,875,525,350,350,350,525,875,82.600000000000122,123.9000000000002,206.50000000000031,1713.9137274378659,0,172.17091825030002,610.98363967533726,404.48363967533697,996.63931506849474,144.80357142857133,123.9000000000002,null,375.9480000000006,162.46324285714311,null,null,null,{"$f":"JW43","v":2.5},350,525,875,236.00000000000037,2.5,350,525,875,{"$f":"KF43","v":0.56785714285714284},21,-1.5,8.2232142857142865,12.723214285714285,0.80796004842615066,12.723214285714285,15,0,0,904.59642857142853,1593,144.80357142857147,543.6,1984.5,729.53778919618537,2528.1,1,729.53778919618537,645.54794520547944,2588.9137274378659,875,525,350,350,350,525,875,82.600000000000122,123.9000000000002,206.50000000000031,1713.9137274378659,34.173642857142923,172.17091825030002,610.98363967533726,404.48363967533697,996.63931506849474,144.80357142857133,123.9000000000002,null,375.9480000000006,162.46324285714311,null,null,null,2.5,350,525,875,236.00000000000037,2.5,350,525,875,0.56785714285714284,21,13.584745762711865,5.0187651331719128,-1.5,8.0357142857142865,8.0357142857142865,15,0,606.47142857142865,1593,442.92857142857133,543.6,1984.5,729.53778919618537,2528.1,1,729.53778919618537,645.54794520547944,2887.0387274378659,875,525,350,350,350,525,875,82.600000000000122,123.9000000000002,206.50000000000031,2012.0387274378659,104.531142857143,172.17091825030002,681.34113967533744,474.8411396753371,996.63931506849474,442.92857142857122,123.9000000000002,4223.0479452054797,375.9480000000006,232.82074285714319]
[25.034246575342468,-0.5,-0.5,9875.6,31.450955414012739,1896.3,314,1.8962999999999999,6751,21,13.584745762711865,5.5866222760290558,-0.5,8.4035714285714285,8.4035714285714285,15,13.906716082659479,274.75,1044.4938330520918,63.400124924614467,51.802098758767578,0.4195328571428571,1.8851463382004745,3.3264134810576174,4.0640479452054796,1.5222,0.73763446414786227,2.7601463382004745,0.64554794520547942,0.35,0.52500000000000002,0.875,0.56626714285714286,1.4412671428571429,0.58732876712328763,5.8219178082191785E-2,0,587.32876712328766,58.219178082191782,0,null,0.64554794520547942,0.64554794520547942,1.8608,null,null,null,null,null,null,null,null,null,null,null,null,null,null,null,null,null,null,null,null,null,null,184.42123287671231,18.280821917808222,0,null,null,null,null,null,null,null,null,null,null,28.840573267506375,0,33.709223603166564,0,112.13137932944355,0,33.753287947745868,0,208.43446414786234,208.43446414786231,529.19999999999993,737.63446414786222,65.448421742428778,737.63446414786222,null,null,null,null,null,null,null,null,null,null,null,null,null,null,null,null,null,null,null,null,null,null,null,null,null,null,null,null,null,null,null,null,null,null,null,null,null,null,null,null,null,null,null,null,null,null,null,null,null,null,null,null,null,null,null,null,null,null,null,null,null,null,null,null,null,null,null,null,null,null,null,null,null,null,null,null,null,null,null,null,null,null,2.5,350,525,875,314,2.5,350,525,875,0.56785714285714284,21,13.584745762711865,5.5866222760290558,-0.5,8.4035714285714285,22.161433063791556,22.161433063791556,0,566.26714285714286,1522.2,0,955.93285714285719,1896.3,737.63446414786222,2852.232857142857,1,737.63446414786222,645.54794520547944,2760.1463382004745,875,525,350,350,350,525,875,109.89999999999999,164.85,274.75,1885.1463382004745,0,231.61722174242874,866.68595019494899,591.93595019494899,1276.1110547945207,874.99999999999989,164.85,null,477.9708,300.16291714285717,null,null,null,2.5,350,525,875,314,2.5,350,525,875,0.56785714285714284,21,-0.5,8.7910714285714295,13.091071428571427,1.3758171912832937,26.848933063791556,26.848933063791556,0,0,864.39214285714274,1522.2,0,657.8078571428573,1896.3,737.63446414786222,2554.107857142857,1,737.63446414786222,645.54794520547944,2462.0213382004749,875,525,350,350,350,525,875,109.89999999999999,164.85,274.75,1587.0213382004749,0,231.61722174242874,773.07470019494906,498.32470019494912,1276.1110547945207,121.40785714285721,164.85,null,477.9708,206.55166714285718,null,null,null,{"$f":"JW44","v":2.5},350,525,875,314,2.5,350,525,875,{"$f":"KF44","v":0.56785714285714284},21,-0.5,8.7910714285714295,13.091071428571427,1.3758171912832937,13.091071428571427,15,0,0,864.39214285714274,1522.2,121.40785714285725,536.40000000000009,1896.3,737.63446414786222,2432.6999999999998,1,737.63446414786222,645.54794520547944,2462.0213382004749,875,525,350,350,350,525,875,109.89999999999999,164.85,274.75,1587.0213382004749,38.122067142857176,231.61722174242874,773.07470019494906,498.32470019494912,1276.1110547945207,121.40785714285721,164.85,null,477.9708,206.55166714285718,null,null,null,2.5,350,525,875,314,2.5,350,525,875,0.56785714285714284,21,13.584745762711865,5.5866222760290558,-0.5,8.4035714285714285,8.4035714285714285,15,0,566.26714285714286,1522.2,419.5328571428571,536.40000000000009,1896.3,737.63446414786222,2432.6999999999998,1,737.63446414786222,645.54794520547944,2760.1463382004745,875,525,350,350,350,525,875,109.89999999999999,164.85,274.75,1885.1463382004745,131.73331714285712,231.61722174242874,866.68595019494899,591.93595019494899,1276.1110547945207,419.5328571428571,164.85,4064.0479452054797,477.9708,300.16291714285717]
[31.244292237442924,0.5,0.5,15520.899999999989,28.531066176470574,1808.1000000000001,543.99999999999989,1.8081,11151.999999999998,21,13.584745762711865,6.1544794188861989,0.5,8.7714285714285722,8.7714285714285722,15,14.274573225516622,475.99999999999989,1733.5998450110458,61.90012492461446,50.606358820380315,0.39613714285714274,1.7857015638333307,3.1867644209761878,3.9050479452054794,1.4513999999999998,0.71828352422929143,2.6607015638333316,0.64554794520547942,0.35,0.52500000000000002,0.875,0.52606285714285717,1.4010628571428572,0.58732876712328763,5.8219178082191785E-2,0,587.32876712328766,58.219178082191782,0,null,0.64554794520547942,0.64554794520547942,1.7971999999999999,null,null,null,null,null,null,null,null,null,null,null,null,null,null,null,null,null,null,null,null,null,null,319.50684931506839,31.671232876712324,0,null,null,null,null,null,null,null,null,null,null,26.163030459035173,0,30.579678000843312,0,101.7211643332745,0,30.619651436138533,0,189.0835242292915,189.0835242292915,529.19999999999993,718.2835242292914,102.86143718073455,718.2835242292914,null,null,null,null,null,null,null,null,null,null,null,null,null,null,null,null,null,null,null,null,null,null,null,null,null,null,null,null,null,null,null,null,null,null,null,null,null,null,null,null,null,null,null,null,null,null,null,null,null,null,null,null,null,null,null,null,null,null,null,null,null,null,null,null,null,null,null,null,null,null,null,null,null,null,null,null,null,null,null,null,null,null,2.5,350,525,875,543.99999999999989,2.5,350,525,875,0.56785714285714284,21,13.584745762711865,6.1544794188861989,0.5,8.7714285714285722,22.5292902066487,22.5292902066487,0.5,526.06285714285718,1451.3999999999999,0,925.33714285714268,1808.1000000000001,718.2835242292914,2733.437142857143,1,718.2835242292914,645.54794520547944,2660.7015638333314,875,525,350,350,350,525,875,190.39999999999995,285.59999999999997,475.99999999999989,1785.7015638333314,0,390.74623718073445,1447.421650725332,971.42165072533203,2124.3460821917806,875,285.59999999999997,null,789.56159999999977,503.38340571428552,null,null,null,2.5,350,525,875,543.99999999999989,2.5,350,525,875,0.56785714285714284,21,0.5,9.3589285714285726,13.45892857142857,1.9436743341404368,27.216790206648696,27.216790206648696,0,0.5,824.18785714285707,1451.3999999999999,0,627.21214285714279,1808.1000000000001,718.2835242292914,2435.312142857143,1,718.2835242292914,645.54794520547944,2362.5765638333314,875,525,350,350,350,525,875,190.39999999999995,285.59999999999997,475.99999999999989,1487.5765638333314,0,390.74623718073445,1285.241650725332,809.24165072533208,2124.3460821917806,98.012142857142862,285.59999999999997,null,789.56159999999977,341.20340571428562,null,null,null,{"$f":"JW45","v":2.5},350,525,875,543.99999999999989,2.5,350,525,875,{"$f":"KF45","v":0.56785714285714284},21,0.5,9.3589285714285726,13.45892857142857,1.9436743341404368,13.45892857142857,15,0,0.5,824.18785714285707,1451.3999999999999,98.012142857142905,529.19999999999993,1808.1000000000001,718.2835242292914,2337.3000000000002,1,718.2835242292914,645.54794520547944,2362.5765638333314,875,525,350,350,350,525,875,190.39999999999995,285.59999999999997,475.99999999999989,1487.5765638333314,53.318605714285731,390.74623718073445,1285.241650725332,809.24165072533208,2124.3460821917806,98.012142857142862,285.59999999999997,null,789.56159999999977,341.20340571428562,null,null,null,2.5,350,525,875,543.99999999999989,2.5,350,525,875,0.56785714285714284,21,13.584745762711865,6.1544794188861989,0.5,8.7714285714285722,8.7714285714285722,15,0.5,526.06285714285718,1451.3999999999999,396.13714285714275,529.19999999999993,1808.1000000000001,718.2835242292914,2337.3000000000002,1,718.2835242292914,645.54794520547944,2660.7015638333314,875,525,350,350,350,525,875,190.39999999999995,285.59999999999997,475.99999999999989,1785.7015638333314,215.49860571428562,390.74623718073445,1447.421650725332,971.42165072533203,2124.3460821917806,396.13714285714275,285.59999999999997,3905.0479452054797,789.56159999999977,503.38340571428552]
[36.803652968036531,1.5,1.5,16252.900000000001,33.3735112936345,1719.9,487,1.7199,9496.5,21,13.584745762711865,6.7223365617433419,1.5,9.1392857142857142,9.1392857142857142,15,14.642430368373766,426.125,1458.892339069866,60.40012492461446,48.601763429993227,0.3727414285714285,1.6348135827189973,2.9956721541475688,3.7460479452054791,1.3805999999999998,0.75037579105791041,2.5098135827189978,0.64554794520547942,0.35,0.52500000000000002,0.875,0.48585857142857142,1.3608585714285715,0.58732876712328763,5.8219178082191785E-2,0,587.32876712328766,58.219178082191782,0,null,0.64554794520547942,0.64554794520547942,1.7336,null,null,null,null,null,null,null,null,null,null,null,null,null,null,null,null,null,null,null,null,null,null,286.02910958904107,28.352739726027398,0,null,null,null,null,null,null,null,null,null,null,30.603559891512148,0,35.769824471491155,0,118.98582428293041,0,35.816582411976768,0,221.17579105791049,221.17579105791049,529.19999999999993,750.37579105791042,107.71261024520241,750.37579105791042,null,null,null,null,null,null,null,null,null,null,null,null,null,null,null,null,null,null,null,null,null,null,null,null,null,null,null,null,null,null,null,null,null,null,null,null,null,null,null,null,null,null,null,null,null,null,null,null,null,null,null,null,null,null,null,null,null,null,null,null,null,null,null,null,null,null,null,null,null,null,null,null,null,null,null,null,null,null,null,null,null,null,2.5,350,525,875,487,2.5,350,525,875,0.56785714285714284,21,13.584745762711865,6.7223365617433419,1.5,9.1392857142857142,22.897147349505843,22.897147349505843,1.5,485.85857142857139,1380.6,0,894.74142857142851,1719.9,750.37579105791042,2614.6414285714286,1,750.37579105791042,645.54794520547944,2509.8135827189976,875,525,350,350,350,525,875,170.45,255.67500000000001,426.125,1634.8135827189976,0,365.43301024520235,1222.2792147841519,796.1542147841518,1824.3253493150685,875.00000000000023,255.67500000000001,null,672.35219999999993,435.73907571428566,null,null,null,2.5,350,525,875,487,2.5,350,525,875,0.56785714285714284,21,1.5,9.9267857142857139,13.826785714285714,2.5115314769975781,27.584647349505843,27.584647349505843,0,1.5,783.98357142857139,1380.6,0,596.61642857142851,1719.9,750.37579105791042,2316.5164285714286,1,750.37579105791042,645.54794520547944,2211.6885827189976,875,525,350,350,350,525,875,170.45,255.67500000000001,426.125,1336.6885827189976,0,365.43301024520235,1077.0923397841518,650.96733978415182,1824.3253493150685,74.616428571428514,255.67500000000001,null,672.35219999999993,290.55220071428568,null,null,null,{"$f":"JW46","v":2.5},350,525,875,487,2.5,350,525,875,{"$f":"KF46","v":0.56785714285714284},21,1.5,9.9267857142857139,13.826785714285714,2.5115314769975781,13.826785714285714,15,0,1.5,783.98357142857139,1380.6,74.616428571428571,522,1719.9,750.37579105791042,2241.9,1,750.37579105791042,645.54794520547944,2211.6885827189976,875,525,350,350,350,525,875,170.45,255.67500000000001,426.125,1336.6885827189976,36.338200714285712,365.43301024520235,1077.0923397841518,650.96733978415182,1824.3253493150685,74.616428571428514,255.67500000000001,null,672.35219999999993,290.55220071428568,null,null,null,2.5,350,525,875,487,2.5,350,525,875,0.56785714285714284,21,13.584745762711865,6.7223365617433419,1.5,9.1392857142857142,9.1392857142857142,15,1.5,485.85857142857139,1380.6,372.74142857142851,522,1719.9,750.37579105791042,2241.9,1,750.37579105791042,645.54794520547944,2509.8135827189976,875,525,350,350,350,525,875,170.45,255.67500000000001,426.125,1634.8135827189976,181.52507571428569,365.43301024520235,1222.2792147841519,796.1542147841518,1824.3253493150685,372.74142857142851,255.67500000000001,3746.0479452054797,672.35219999999993,435.73907571428566]
[41.974885844748862,2.5,2.5,22112.999999999978,48.814569536423768,1631.7,453.00000000000023,1.6317000000000002,8380.5000000000036,21,13.584745762711865,7.290193704600485,2.5,9.5071428571428562,9.5071428571428562,15,15.010287511230906,396.37500000000023,1238.6559525461491,58.90012492461446,45.492764954327846,0.34934571428571431,1.4136855653809643,2.7343398510952506,3.5870479452054793,1.3097999999999999,0.85270809411022896,2.2886855653809648,0.64554794520547942,0.35,0.52500000000000002,0.875,0.44565428571428567,1.3206542857142858,0.58732876712328763,5.8219178082191785E-2,0,587.32876712328766,58.219178082191782,0,null,0.64554794520547942,0.64554794520547942,1.6700000000000002,null,null,null,null,null,null,null,null,null,null,null,null,null,null,null,null,null,null,null,null,null,null,266.05993150684941,26.373287671232891,0,null,null,null,null,null,null,null,null,null,null,44.763033450162261,0,52.319594681136174,0,174.03747967076038,0,52.387986308170341,0,323.50809411022914,323.50809411022914,529.19999999999993,852.70809411022901,146.54916663193387,852.70809411022901,null,null,null,null,null,null,null,null,null,null,null,null,null,null,null,null,null,null,null,null,null,null,null,null,null,null,null,null,null,null,null,null,null,null,null,null,null,null,null,null,null,null,null,null,null,null,null,null,null,null,null,null,null,null,null,null,null,null,null,null,null,null,null,null,null,null,null,null,null,null,null,null,null,null,null,null,null,null,null,null,null,null,2.5,350,525,875,453.00000000000023,2.5,350,525,875,0.56785714285714284,21,13.584745762711865,7.290193704600485,2.5,9.5071428571428562,23.265004492362984,23.265004492362984,2.5,445.65428571428566,1309.8,0,864.14571428571435,1631.7,852.70809411022901,2495.8457142857142,1,852.70809411022901,645.54794520547944,2288.6855653809648,875,525,350,350,350,525,875,158.55000000000007,237.82500000000013,396.37500000000023,1413.6855653809648,0,386.27676663193392,1036.7745611175776,640.39956111757738,1624.9327191780831,875,237.82500000000013,null,593.33940000000018,391.45800857142876,null,null,null,2.5,350,525,875,453.00000000000023,2.5,350,525,875,0.56785714285714284,21,2.5,10.494642857142857,14.194642857142856,3.0793886198547211,27.952504492362984,27.952504492362984,0,2.5,743.77928571428572,1309.8,0,566.02071428571423,1631.7,852.70809411022901,2197.7207142857142,1,852.70809411022901,645.54794520547944,1990.5605653809648,875,525,350,350,350,525,875,158.55000000000007,237.82500000000013,396.37500000000023,1115.5605653809648,0,386.27676663193392,901.72393611757752,505.3489361175773,1624.9327191780831,51.220714285714166,237.82500000000013,null,593.33940000000018,256.40738357142868,null,null,null,{"$f":"JW47","v":2.5},350,525,875,453.00000000000023,2.5,350,525,875,{"$f":"KF47","v":0.56785714285714284},21,2.5,10.494642857142857,14.194642857142856,3.0793886198547211,14.194642857142856,15,0,2.5,743.77928571428572,1309.8,51.220714285714337,514.79999999999995,1631.7,852.70809411022901,2146.5,1,852.70809411022901,645.54794520547944,1990.5605653809648,875,525,350,350,350,525,875,158.55000000000007,237.82500000000013,396.37500000000023,1115.5605653809648,23.202983571428604,386.27676663193392,901.72393611757752,505.3489361175773,1624.9327191780831,51.220714285714166,237.82500000000013,null,593.33940000000018,256.40738357142868,null,null,null,2.5,350,525,875,453.00000000000023,2.5,350,525,875,0.56785714285714284,21,13.584745762711865,7.290193704600485,2.5,9.5071428571428562,9.5071428571428562,15,2.5,445.65428571428566,1309.8,349.34571428571434,514.79999999999995,1631.7,852.70809411022901,2146.5,1,852.70809411022901,645.54794520547944,2288.6855653809648,875,525,350,350,350,525,875,158.55000000000007,237.82500000000013,396.37500000000023,1413.6855653809648,158.25360857142866,386.27676663193392,1036.7745611175776,640.39956111757738,1624.9327191780831,349.34571428571422,237.82500000000013,3587.0479452054797,593.33940000000018,391.45800857142876]
[45.856164383561641,3.5,3.5,18564.999999999982,54.602941176470615,1543.5,339.99999999999949,1.5435000000000001,5949.9999999999909,21,13.584745762711865,7.8580508474576272,3.5,9.875,9.875,15,15.37814465408805,297.49999999999955,862.57274407226055,57.400124924614467,43.389601557170828,0.32594999999999996,1.2565286590360643,2.5369786590360643,3.4280479452054795,1.2390000000000001,0.89106928616941539,2.1315286590360647,0.64554794520547942,0.35,0.52500000000000002,0.875,0.40545000000000003,1.2804500000000001,0.58732876712328763,5.8219178082191785E-2,0,587.32876712328766,58.219178082191782,0,null,0.64554794520547942,0.64554794520547942,1.6064000000000001,null,null,null,null,null,null,null,null,null,null,null,null,null,null,null,null,null,null,null,null,null,null,199.69178082191749,19.794520547945176,0,null,null,null,null,null,null,null,null,null,null,50.070978922303574,0,58.523587893553241,0,194.6746300379223,0,58.600089315636332,0,361.86928616941549,361.86928616941549,529.19999999999993,891.06928616941536,123.03555729760109,891.06928616941536,null,null,null,null,null,null,null,null,null,null,null,null,null,null,null,null,null,null,null,null,null,null,null,null,null,null,null,null,null,null,null,null,null,null,null,null,null,null,null,null,null,null,null,null,null,null,null,null,null,null,null,null,null,null,null,null,null,null,null,null,null,null,null,null,null,null,null,null,null,null,null,null,null,null,null,null,null,null,null,null,null,null,2.5,350,525,875,339.99999999999949,2.5,350,525,875,0.56785714285714284,21,13.584745762711865,7.8580508474576272,3.5,9.875,23.632861635220127,23.632861635220127,3.5,405.45000000000005,1239,0,833.55,1543.5,891.06928616941536,2377.0500000000002,1,891.06928616941536,645.54794520547944,2131.5286590360647,875,525,350,350,350,525,875,118.99999999999982,178.49999999999974,297.49999999999955,1256.5286590360647,0,302.9635572976008,724.71974407226094,427.21974407226134,1165.5363013698613,875,178.49999999999974,null,421.25999999999942,283.40699999999953,null,null,null,2.5,350,525,875,339.99999999999949,2.5,350,525,875,0.56785714285714284,21,3.5,11.0625,14.5625,3.6472457627118642,28.320361635220127,28.320361635220127,0,3.5,703.57499999999993,1239,0,535.42500000000007,1543.5,891.06928616941536,2078.9250000000002,1,891.06928616941536,645.54794520547944,1833.4036590360647,875,525,350,350,350,525,875,118.99999999999982,178.49999999999974,297.49999999999955,958.40365903606471,0,302.9635572976008,623.3572440722611,325.85724407226149,1165.5363013698613,27.825000000000045,178.49999999999974,null,421.25999999999942,182.04449999999974,null,null,null,{"$f":"JW48","v":2.5},350,525,875,339.99999999999949,2.5,350,525,875,{"$f":"KF48","v":0.56785714285714284},21,3.5,11.0625,14.5625,3.6472457627118642,14.5625,15,0,3.5,703.57499999999993,1239,27.824999999999996,507.60000000000008,1543.5,891.06928616941536,2051.1,1,891.06928616941536,645.54794520547944,1833.4036590360647,875,525,350,350,350,525,875,118.99999999999982,178.49999999999974,297.49999999999955,958.40365903606471,9.4604999999999837,302.9635572976008,623.3572440722611,325.85724407226149,1165.5363013698613,27.825000000000045,178.49999999999974,null,421.25999999999942,182.04449999999974,null,null,null,2.5,350,525,875,339.99999999999949,2.5,350,525,875,0.56785714285714284,21,13.584745762711865,7.8580508474576272,3.5,9.875,9.875,15,3.5,405.45000000000005,1239,325.95,507.59999999999997,1543.5,891.06928616941536,2051.1,1,891.06928616941536,645.54794520547944,2131.5286590360647,875,525,350,350,350,525,875,118.99999999999982,178.49999999999974,297.49999999999955,1256.5286590360647,110.82299999999982,302.9635572976008,724.71974407226094,427.21974407226134,1165.5363013698613,325.94999999999993,178.49999999999974,3428.0479452054797,421.25999999999942,283.40699999999953]
[49.075342465753423,4.5,4.5,18896.999999999989,67.010638297872291,1455.3,282.00000000000006,1.4553,4653.0000000000009,21,13.584745762711865,8.4259079903147693,4.5,10.242857142857144,10.242857142857144,15,15.746001796945194,246.75000000000006,647.40130442875511,55.90012492461446,40.596687208882805,0.30255428571428566,1.055503592199232,2.2957493064849466,3.2690479452054793,1.1682000000000001,0.9732986387205329,1.9305035921992326,0.64554794520547942,0.35,0.52500000000000002,0.875,0.3652457142857144,1.2402457142857144,0.58732876712328763,5.8219178082191785E-2,0,587.32876712328766,58.219178082191782,0,null,0.64554794520547942,0.64554794520547942,1.5428000000000002,null,null,null,null,null,null,null,null,null,null,null,null,null,null,null,null,null,null,null,null,null,null,165.62671232876716,16.417808219178088,0,null,null,null,null,null,null,null,null,null,null,61.448855784873466,0,71.822193012536232,0,238.91151169096284,0,71.916078232160459,0,444.09863872053302,444.09863872053302,529.19999999999993,973.29863872053295,125.23581611919033,973.29863872053295,null,null,null,null,null,null,null,null,null,null,null,null,null,null,null,null,null,null,null,null,null,null,null,null,null,null,null,null,null,null,null,null,null,null,null,null,null,null,null,null,null,null,null,null,null,null,null,null,null,null,null,null,null,null,null,null,null,null,null,null,null,null,null,null,null,null,null,null,null,null,null,null,null,null,null,null,null,null,null,null,null,null,2.5,350,525,875,282.00000000000006,2.5,350,525,875,0.56785714285714284,21,13.584745762711865,8.4259079903147693,4.5,10.242857142857144,24.000718778077271,24.000718778077271,4.5,365.24571428571437,1168.2,0,802.95428571428567,1455.3,973.29863872053295,2258.2542857142857,1,973.29863872053295,645.54794520547944,1930.5035921992326,875,525,350,350,350,525,875,98.700000000000017,148.05000000000004,246.75000000000006,1055.5035921992326,0,274.47021611919035,544.40201300018373,297.65201300018367,921.87152054794547,874.99999999999989,148.05000000000004,null,329.43240000000009,226.43310857142859,null,null,null,2.5,350,525,875,282.00000000000006,2.5,336.55285714285714,504.82928571428567,841.38214285714287,0.56785714285714284,21,4.5,11.630357142857143,14.930357142857142,4.5000000000000009,28.159636118598385,28.159636118598385,0,4.5,663.37071428571426,1168.2,0,504.82928571428579,1455.3,973.29863872053295,1960.1292857142857,1,973.29863872053295,645.54794520547944,1632.3785921992326,875,504.82928571428573,350,336.55285714285714,336.55285714285714,504.82928571428567,841.38214285714287,94.907905714285732,142.36185857142857,237.26976428571433,790.9964493420897,0,274.47021611919035,460.33076300018371,223.06099871446932,921.87152054794547,4.4292857142856974,142.36185857142857,null,329.43240000000009,142.3618585714286,null,null,null,{"$f":"JW49","v":2.5},350,525,875,282.00000000000006,2.5,336.55285714285714,504.82928571428567,841.38214285714287,{"$f":"KF49","v":0.56785714285714284},21,4.5,11.630357142857143,14.930357142857142,4.5000000000000009,14.930357142857142,15,0,4.5,663.37071428571426,1168.2,4.4292857142857684,500.40000000000003,1455.3,973.29863872053295,1955.7,1,973.29863872053295,645.54794520547944,1632.3785921992326,875,504.82928571428573,350,336.55285714285714,336.55285714285714,504.82928571428567,841.38214285714287,94.907905714285732,142.36185857142857,237.26976428571433,790.9964493420897,1.2490585714285869,274.47021611919035,460.33076300018371,223.06099871446932,921.87152054794547,4.4292857142856974,142.36185857142857,null,329.43240000000009,142.3618585714286,null,null,null,2.5,350,525,875,282.00000000000006,2.5,350,525,875,0.56785714285714284,21,13.584745762711865,8.4259079903147693,4.5,10.242857142857144,10.242857142857144,15,4.5,365.24571428571437,1168.2,302.55428571428564,500.40000000000003,1455.3,973.29863872053295,1955.7,1,973.29863872053295,645.54794520547944,1930.5035921992326,875,525,350,350,350,525,875,98.700000000000017,148.05000000000004,246.75000000000006,1055.5035921992326,85.320308571428569,274.47021611919035,544.40201300018373,297.65201300018367,921.87152054794547,302.55428571428558,148.05000000000004,3269.0479452054797,329.43240000000009,226.43310857142859]
[52.363013698630134,5.5,5.5,21386.299999999981,74.25798611111108,1367.1000000000001,287.99999999999989,1.3671000000000002,4463.9999999999982,21,13.584745762711865,8.9937651331719124,5.5,10.610714285714288,10.610714285714288,15,16.113858939802338,251.99999999999989,601.55109003799362,54.400124924614467,38.341494695470487,0.27915857142857131,0.88867763406049405,2.088719062631923,3.1100479452054794,1.0973999999999999,1.0213288825735567,1.7636776340604943,0.64554794520547942,0.35,0.52500000000000002,0.875,0.32504142857142865,1.2000414285714287,0.58732876712328763,5.8219178082191785E-2,0,587.32876712328766,58.219178082191782,0,null,0.64554794520547942,0.64554794520547942,1.4792000000000001,null,null,null,null,null,null,null,null,null,null,null,null,null,null,null,null,null,null,null,null,null,null,169.15068493150676,16.767123287671229,0,null,null,null,null,null,null,null,null,null,null,68.094684595202366,0,79.589921043384521,0,264.75031677911034,0,79.693960155859543,0,492.12888257355678,492.12888257355672,529.19999999999993,1021.3288825735567,141.7331181811843,1021.3288825735567,null,null,null,null,null,null,null,null,null,null,null,null,null,null,null,null,null,null,null,null,null,null,null,null,null,null,null,null,null,null,null,null,null,null,null,null,null,null,null,null,null,null,null,null,null,null,null,null,null,null,null,null,null,null,null,null,null,null,null,null,null,null,null,null,null,null,null,null,null,null,null,null,null,null,null,null,null,null,null,null,null,null,2.5,350,525,875,287.99999999999989,2.5,350,525,875,0.56785714285714284,21,13.584745762711865,8.9937651331719124,5.5,10.610714285714288,24.368575920934415,24.368575920934415,5.5,325.04142857142864,1097.3999999999999,0,772.35857142857117,1367.1000000000001,1021.3288825735567,2139.4585714285713,1,1021.3288825735567,645.54794520547944,1763.6776340604943,875,525,350,350,350,525,875,100.79999999999995,151.19999999999996,251.99999999999989,888.67763406049426,0,294.14271818118419,507.93915860942212,255.93915860942224,895.69380821917775,875,151.19999999999996,null,316.05119999999988,222.43926857142839,null,null,null,2.5,350,525,875,287.99999999999989,2.5,316.15571428571428,474.23357142857139,790.38928571428573,0.56785714285714284,21,5.5,12.198214285714286,15.298214285714286,5.5000000000000009,27.725718778077272,27.725718778077272,0,5.5,623.16642857142847,1097.3999999999999,0,474.23357142857139,1367.1000000000001,1021.3288825735567,1841.3335714285715,1,1021.3288825735567,645.54794520547944,1465.5526340604945,875,474.23357142857145,350,316.15571428571428,316.15571428571428,474.23357142857139,790.38928571428573,91.052845714285667,136.57926857142851,227.63211428571418,675.16334834620875,0,294.14271818118419,422.07915860942228,194.44704432370804,895.69380821917775,0,136.57926857142851,null,316.05119999999988,136.57926857142851,null,null,null,{"$f":"JW50","v":2.5},350,525,875,287.99999999999989,2.5,316.15571428571428,474.23357142857139,790.38928571428573,{"$f":"KF50","v":0.56785714285714284},21,5.5,12.198214285714286,15.298214285714286,5.5000000000000009,15.298214285714286,15.298214285714286,0,5.5,623.16642857142847,1097.3999999999999,0,474.23357142857139,1367.1000000000001,1021.3288825735567,1841.3335714285715,1,1021.3288825735567,645.54794520547944,1465.5526340604945,875,474.23357142857145,350,316.15571428571428,316.15571428571428,474.23357142857139,790.38928571428573,91.052845714285667,136.57926857142851,227.63211428571418,675.16334834620875,0,294.14271818118419,422.07915860942228,194.44704432370804,895.69380821917775,0,136.57926857142851,null,316.05119999999988,136.57926857142851,null,null,null,2.5,350,525,875,287.99999999999989,2.5,350,525,875,0.56785714285714284,21,13.584745762711865,8.9937651331719124,5.5,10.610714285714288,10.610714285714288,15,5.5,325.04142857142864,1097.3999999999999,279.15857142857129,493.19999999999987,1367.1000000000001,1021.3288825735567,1860.3,1,1021.3288825735567,645.54794520547944,1763.6776340604943,875,525,350,350,350,525,875,100.79999999999995,151.19999999999996,251.99999999999989,888.67763406049426,80.397668571428511,294.14271818118419,507.93915860942212,255.93915860942224,895.69380821917775,279.15857142857129,151.19999999999996,3110.0479452054797,316.05119999999988,222.43926857142839]
[55.707762557077622,6.5,6.5,13825.599999999999,47.186348122866889,1278.9000000000001,293,1.2789000000000001,4248.5,21,13.584745762711865,9.5616222760290555,6.5,10.97857142857143,10.97857142857143,15,16.481716082659482,256.375,617.97524805435091,52.900124924614467,39.662429865324611,0.25576285714285707,0.94929339657750189,2.1091305394346449,2.9510479452054796,1.0266,0.84191740577083463,1.8242933965775021,0.64554794520547942,0.35,0.52500000000000002,0.875,0.2848371428571429,1.159837142857143,0.58732876712328763,5.8219178082191785E-2,0,587.32876712328766,58.219178082191782,0,null,0.64554794520547942,0.64554794520547942,1.4156,null,null,null,null,null,null,null,null,null,null,null,null,null,null,null,null,null,null,null,null,null,null,172.08732876712327,17.058219178082194,0,null,null,null,null,null,null,null,null,null,null,43.269951972819044,0,50.574462331973933,0,168.23241872579064,0,50.640572740251038,0,312.71740577083466,312.71740577083466,529.19999999999993,841.91740577083465,91.626199890854551,841.91740577083465,null,null,null,null,null,null,null,null,null,null,null,null,null,null,null,null,null,null,null,null,null,null,null,null,null,null,null,null,null,null,null,null,null,null,null,null,null,null,null,null,null,null,null,null,null,null,null,null,null,null,null,null,null,null,null,null,null,null,null,null,null,null,null,null,null,null,null,null,null,null,null,null,null,null,null,null,null,null,null,null,null,null,2.5,350,525,875,293,2.5,350,525,875,0.56785714285714284,21,13.584745762711865,9.5616222760290555,6.5,10.97857142857143,24.736433063791559,24.736433063791559,6.5,284.83714285714291,1026.5999999999999,0,741.762857142857,1278.9000000000001,841.91740577083465,2020.6628571428571,1,841.91740577083465,645.54794520547944,1824.2933965775021,875,525,350,350,350,525,875,102.55,153.82500000000002,256.375,949.29339657750211,0,246.68179989085453,534.51796519720813,278.14296519720813,864.65704794520559,875.00000000000023,153.82500000000002,null,300.79379999999998,217.33651714285708,null,null,null,2.5,350,525,875,293,2.5,295.75857142857143,443.63785714285711,739.3964285714286,0.56785714285714284,21,6.5,12.766071428571429,15.666071428571428,6.5000000000000009,27.291801437556153,27.291801437556153,0,6.5,582.96214285714279,1026.5999999999999,0,443.63785714285711,1278.9000000000001,841.91740577083465,1722.5378571428573,1,841.91740577083465,645.54794520547944,1526.1683965775023,875,443.63785714285717,350,295.75857142857143,295.75857142857143,443.63785714285711,739.3964285714286,86.657261428571431,129.98589214285715,216.6431535714286,786.77196800607373,0,246.68179989085453,447.1673401972082,230.52418662577961,864.65704794520559,0,129.98589214285715,null,300.79379999999998,129.98589214285715,null,null,null,{"$f":"JW51","v":2.5},350,525,875,293,2.5,295.75857142857143,443.63785714285711,739.3964285714286,{"$f":"KF51","v":0.56785714285714284},21,6.5,12.766071428571429,15.666071428571428,6.5000000000000009,15.666071428571428,15.666071428571428,0,6.5,582.96214285714279,1026.5999999999999,0,443.63785714285711,1278.9000000000001,841.91740577083465,1722.5378571428573,1,841.91740577083465,645.54794520547944,1526.1683965775023,875,443.63785714285717,350,295.75857142857143,295.75857142857143,443.63785714285711,739.3964285714286,86.657261428571431,129.98589214285715,216.6431535714286,786.77196800607373,0,246.68179989085453,447.1673401972082,230.52418662577961,864.65704794520559,0,129.98589214285715,null,300.79379999999998,129.98589214285715,null,null,null,2.5,350,525,875,293,2.5,350,525,875,0.56785714285714284,21,13.584745762711865,9.5616222760290555,6.5,10.97857142857143,10.97857142857143,15,6.5,284.83714285714291,1026.5999999999999,255.76285714285706,485.99999999999994,1278.9000000000001,841.91740577083465,1764.9,1,841.91740577083465,645.54794520547944,1824.2933965775021,875,525,350,350,350,525,875,102.55,153.82500000000002,256.375,949.29339657750211,74.938517142857123,246.68179989085453,534.51796519720813,278.14296519720813,864.65704794520559,255.762857142857,153.82500000000002,2951.0479452054797,300.79379999999998,217.33651714285708]
[59.006849315068486,7.5,7.5,21106.499999999996,73.032871972318418,1190.7,288.99999999999966,1.1907000000000001,3901.4999999999955,21,13.584745762711865,10.129479418886199,7.5,11.346428571428572,11.346428571428572,15,16.849573225516622,252.87499999999972,514.08425249609195,51.40012492461446,35.469154778791136,0.23236714285714283,0.6592053867882588,1.7788382439311161,{"$f":"H53+Z53+AC53","v":2.7920479452054794},0.95579999999999998,1.0132097012743633,1.5342053867882592,0.64554794520547942,0.35,0.52500000000000002,0.875,0.24463285714285718,1.1196328571428571,0.58732876712328763,5.8219178082191785E-2,0,587.32876712328766,58.219178082191782,0,null,0.64554794520547942,0.64554794520547942,1.3519999999999999,null,null,null,null,null,null,null,null,null,null,null,null,null,null,null,null,null,null,null,null,null,null,169.73801369862991,16.825342465753405,0,null,null,null,null,null,null,null,null,null,null,66.971253093176657,0,78.276840219596153,0,260.38244507504061,0,78.379162886549892,0,484.00970127436335,484.00970127436335,529.19999999999993,1013.2097012743633,139.87880366829083,1013.2097012743633,null,null,null,null,null,null,null,null,null,null,null,null,null,null,null,null,null,null,null,null,null,null,null,null,null,null,null,null,null,null,null,null,null,null,null,null,null,null,null,null,null,null,null,null,null,null,null,null,null,null,null,null,null,null,null,null,null,null,null,null,null,null,null,null,null,null,null,null,null,null,null,null,null,null,null,null,null,null,null,null,null,null,2.5,350,525,875,288.99999999999966,2.5,350,525,875,0.56785714285714284,21,13.584745762711865,10.129479418886199,7.5,11.346428571428572,25.104290206648699,25.104290206648699,7.5,244.63285714285718,955.8,0,711.16714285714284,1190.7,1013.2097012743633,1901.8671428571429,1,1013.2097012743633,645.54794520547944,1534.2053867882591,875,525,350,350,350,525,875,101.14999999999988,151.72499999999982,252.87499999999972,659.20538678825915,0,292.81760366829064,443.38535678180642,190.51035678180665,806.90185616438271,875,151.72499999999982,null,276.22619999999966,205.52730428571405,null,null,null,2.5,350,525,875,288.99999999999966,2.5,275.36142857142858,413.04214285714284,688.40357142857147,0.56785714285714284,21,7.5,13.333928571428572,16.033928571428568,7.5000000000000009,26.85788409703504,26.85788409703504,0,7.5,542.75785714285712,955.8,0,413.04214285714284,1190.7,1013.2097012743633,1603.7421428571429,1,1013.2097012743633,645.54794520547944,1236.0803867882591,875,413.04214285714289,350,275.36142857142858,275.36142857142858,413.04214285714284,688.40357142857147,79.579452857142769,119.36917928571414,198.94863214285692,547.67681535968768,0,292.81760366829064,357.22723178180644,158.27859963894957,806.90185616438271,0,119.36917928571414,null,276.22619999999966,119.36917928571414,null,null,null,{"$f":"JW52","v":2.5},350,525,875,288.99999999999966,2.5,275.36142857142858,413.04214285714284,688.40357142857147,{"$f":"KF52","v":0.56785714285714284},21,7.5,13.333928571428572,16.033928571428568,7.5000000000000009,16.033928571428568,16.033928571428568,0,7.5,542.75785714285712,955.8,0,413.04214285714284,1190.7,1013.2097012743633,1603.7421428571429,1,1013.2097012743633,645.54794520547944,1236.0803867882591,875,413.04214285714289,350,275.36142857142858,275.36142857142858,413.04214285714284,688.40357142857147,79.579452857142769,119.36917928571414,198.94863214285692,547.67681535968768,0,292.81760366829064,357.22723178180644,158.27859963894957,806.90185616438271,0,119.36917928571414,null,276.22619999999966,119.36917928571414,null,null,null,2.5,350,525,875,288.99999999999966,2.5,350,525,875,0.56785714285714284,21,13.584745762711865,10.129479418886199,7.5,11.346428571428572,11.346428571428572,15,7.5,244.63285714285718,955.8,232.36714285714282,478.8,1190.7,1013.2097012743633,1669.5,1,1013.2097012743633,645.54794520547944,1534.2053867882591,875,525,350,350,350,525,875,101.14999999999988,151.72499999999982,252.87499999999972,659.20538678825915,67.154104285714197,292.81760366829064,443.38535678180642,190.51035678180665,{"$f":"(MU53+MR53+MZ53)/1000*$MC53","v":806.90185616438271},232.36714285714277,151.72499999999982,2792.0479452054797,276.22619999999966,205.52730428571405]
[62.237442922374427,8.5,8.5,21390.6,75.585159010600577,1102.5,283.00000000000045,1.1025,3537.5000000000055,21,13.584745762711865,10.697336561743342,8.5,11.714285714285715,11.714285714285715,15,17.217430368373766,247.6250000000004,453.62735298385638,49.900124924614467,33.703199823535776,0.20897142857142847,0.52349493734830355,1.6029235087768752,2.6330479452054796,0.88500000000000001,1.0301244364286044,1.3984949373483038,0.64554794520547942,0.35,0.52500000000000002,0.875,0.20442857142857143,1.0794285714285714,0.58732876712328763,5.8219178082191785E-2,0,587.32876712328766,58.219178082191782,0,null,0.64554794520547942,0.64554794520547942,1.2883999999999998,null,null,null,null,null,null,null,null,null,null,null,null,null,null,null,null,null,null,null,null,null,null,166.21404109589068,16.476027397260303,0,null,null,null,null,null,null,null,null,null,null,69.311704133798699,0,81.012388737609854,0,269.48205627221677,0,81.118287284979274,0,500.92443642860457,500.92443642860457,529.19999999999993,1030.1244364286044,141.76161550929532,1030.1244364286044,null,null,null,null,null,null,null,null,null,null,null,null,null,null,null,null,null,null,null,null,null,null,null,null,null,null,null,null,null,null,null,null,null,null,null,null,null,null,null,null,null,null,null,null,null,null,null,null,null,null,null,null,null,null,null,null,null,null,null,null,null,null,null,null,null,null,null,null,null,null,null,null,null,null,null,null,null,null,null,null,null,null,2.5,350,525,875,283.00000000000045,2.5,350,525,875,0.56785714285714284,21,13.584745762711865,10.697336561743342,8.5,11.714285714285715,25.472147349505843,25.472147349505843,8.5,204.42857142857144,885,0,680.57142857142856,1102.5,1030.1244364286044,1783.0714285714284,1,1030.1244364286044,645.54794520547944,1398.4949373483037,875,525,350,350,350,525,875,99.050000000000153,148.57500000000024,247.6250000000004,523.49493734830367,0,291.52521550929549,395.77406726957059,148.14906726957017,745.15256849315188,875.00000000000011,148.57500000000024,null,250.45500000000041,192.60171428571459,null,null,null,2.5,350,525,875,283.00000000000045,2.5,254.96428571428575,382.44642857142861,637.41071428571433,0.56785714285714284,21,8.5,13.901785714285715,16.401785714285712,8.5,26.423966756513927,26.423966756513927,0,8.5,502.55357142857133,885,0,382.44642857142867,1102.5,1030.1244364286044,1484.9464285714287,1,1030.1244364286044,645.54794520547944,1100.3699373483039,875,382.44642857142861,350,254.96428571428575,254.96428571428575,382.44642857142861,637.41071428571433,72.154892857142983,108.23233928571447,180.38723214285747,462.95922306258956,0,291.52521550929549,311.40469226957049,131.01746012671305,745.15256849315188,0,108.23233928571447,null,250.45500000000041,108.23233928571449,null,null,null,{"$f":"JW53","v":2.5},350,525,875,283.00000000000045,2.5,254.96428571428575,382.44642857142861,637.41071428571433,{"$f":"KF53","v":0.56785714285714284},21,8.5,13.901785714285715,16.401785714285712,8.5,16.401785714285712,16.401785714285712,0,8.5,502.55357142857133,885,0,382.44642857142867,1102.5,1030.1244364286044,1484.9464285714287,1,1030.1244364286044,645.54794520547944,1100.3699373483039,875,382.44642857142861,350,254.96428571428575,254.96428571428575,382.44642857142861,637.41071428571433,72.154892857142983,108.23233928571447,180.38723214285747,462.95922306258956,0,291.52521550929549,311.40469226957049,131.01746012671305,745.15256849315188,0,108.23233928571447,null,250.45500000000041,108.23233928571449,null,null,null,2.5,350,525,875,283.00000000000045,2.5,350,525,875,0.56785714285714284,21,13.584745762711865,10.697336561743342,8.5,11.714285714285715,11.714285714285715,15,8.5,204.42857142857144,885,208.97142857142848,471.60000000000008,1102.5,1030.1244364286044,1574.1000000000001,1,1030.1244364286044,645.54794520547944,1398.4949373483037,875,525,350,350,350,525,875,99.050000000000153,148.57500000000024,247.6250000000004,523.49493734830367,59.138914285714357,291.52521550929549,395.77406726957059,148.14906726957017,{"$f":"(MU54+MR54+MZ54)/1000*$MC54","v":745.15256849315188},208.97142857142853,148.57500000000024,{"$f":"(MU54+MR54+MZ54)","v":2633.0479452054797},250.45500000000041,192.60171428571459]
[65.55936073059361,9.5,9.5,28883.200000000004,99.254982817869276,1014.3000000000001,291.00000000000045,1.0143,3346.5000000000055,21,13.584745762711865,11.265193704600485,9.5,12.082142857142857,12.082142857142857,15,17.585287511230909,254.6250000000004,374.53353640502024,48.40012492461446,29.736742549278119,0.18557571428571426,0.24783254041980229,1.2870568261340882,2.4740479452054793,0.81419999999999992,1.1869911190713911,1.122832540419803,0.64554794520547942,0.35,0.52500000000000002,0.875,0.16422428571428574,1.0392242857142857,0.58732876712328763,5.8219178082191785E-2,0,587.32876712328766,58.219178082191782,0,null,0.64554794520547942,0.64554794520547942,1.2247999999999999,null,null,null,null,null,null,null,null,null,null,null,null,null,null,null,null,null,null,null,null,null,null,170.91267123287696,16.941780821917835,0,null,null,null,null,null,null,null,null,null,null,91.016968052056313,0,106.38177331952565,0,353.87154323868941,0,106.52083446111982,0,657.79111907139122,657.79111907139122,529.19999999999993,1186.991119071391,191.41721564977513,1186.991119071391,null,null,null,null,null,null,null,null,null,null,null,null,null,null,null,null,null,null,null,null,null,null,null,null,null,null,null,null,null,null,null,null,null,null,null,null,null,null,null,null,null,null,null,null,null,null,null,null,null,null,null,null,null,null,null,null,null,null,null,null,null,null,null,null,null,null,null,null,null,null,null,null,null,null,null,null,null,null,null,null,null,null,2.5,350,525,875,291.00000000000045,2.5,350,525,875,0.56785714285714284,21,13.584745762711865,11.265193704600485,9.5,12.082142857142857,25.840004492362986,25.840004492362986,9.5,164.22428571428574,814.19999999999993,0,649.97571428571416,1014.3000000000001,1186.991119071391,1664.2757142857142,1,1186.991119071391,645.54794520547944,1122.8325404198029,875,525,350,350,350,525,875,101.85000000000015,152.77500000000023,254.6250000000004,247.83254041980285,0,345.41441564977532,326.74426926216319,72.119269262162746,719.94795205479579,875,152.77500000000023,null,236.93220000000034,189.14293285714314,null,null,null,2.5,350,525,875,291.00000000000045,2.5,234.5671428571429,351.85071428571433,586.4178571428572,0.56785714285714284,21,9.5,14.469642857142858,16.769642857142856,9.5,25.990049415992814,25.990049415992814,0,9.5,462.3492857142856,814.19999999999993,0,351.85071428571433,1014.3000000000001,1186.991119071391,1366.1507142857145,1,1186.991119071391,645.54794520547944,824.70754041980308,824.70754041980308,351.85071428571433,{"$f":"IY55/HZ55","v":329.88301616792126},234.5671428571429,234.5671428571429,351.85071428571433,586.4178571428572,68.25903857142869,102.38855785714304,170.64759642857172,238.28968327694588,0,345.41441564977532,239.98989426216306,69.34229783359136,719.94795205479579,0,102.38855785714304,null,236.93220000000034,102.38855785714304,null,null,null,{"$f":"JW54","v":2.5},350,525,875,291.00000000000045,2.5,234.5671428571429,351.85071428571433,586.4178571428572,{"$f":"KF54","v":0.56785714285714284},21,9.5,14.469642857142858,16.769642857142856,9.5,16.769642857142856,16.769642857142856,0,9.5,462.3492857142856,814.19999999999993,0,351.85071428571433,1014.3000000000001,1186.991119071391,1366.1507142857145,1,1186.991119071391,645.54794520547944,824.70754041980308,824.70754041980308,351.85071428571433,329.88301616792126,234.5671428571429,234.5671428571429,351.85071428571433,586.4178571428572,68.25903857142869,102.38855785714304,170.64759642857172,238.28968327694588,0,345.41441564977532,239.98989426216306,69.34229783359136,719.94795205479579,0,102.38855785714304,null,236.93220000000034,102.38855785714304,null,null,null,2.5,350,525,875,291.00000000000045,2.5,350,525,875,0.56785714285714284,21,13.584745762711865,11.265193704600485,9.5,12.082142857142857,12.082142857142857,15,9.5,164.22428571428574,814.19999999999993,185.57571428571427,464.39999999999986,1014.3000000000001,1186.991119071391,1478.6999999999998,1,1186.991119071391,645.54794520547944,1122.8325404198029,875,525,350,350,350,525,875,101.85000000000015,152.77500000000023,254.6250000000004,247.83254041980285,54.002532857142931,345.41441564977532,326.74426926216319,72.119269262162746,719.94795205479579,185.57571428571421,152.77500000000023,{"$f":"(MU55+MR55+MZ55)","v":2474.0479452054797},236.93220000000034,189.14293285714314]
[68.80136986301369,10.5,{"$f":"MAX($C$21*($C$19-B56)+B56,B56)","v":10.5},31078.100000000013,109.42992957746523,926.1,283.99999999999898,0.92610000000000003,2981.9999999999891,21,13.584745762711865,11.833050847457628,10.5,12.45,12.45,15,17.953144654088049,248.49999999999909,301.21737160934384,46.900124924614467,27.176486602519315,0.16218000000000005,6.1604547920228736E-2,1.0606245479202285,2.3150479452054795,{"$f":"($FX$3*GM56+$HY$3*IO56+$KA$3*KQ56+$MC$3*MR56)/(1000)","v":0.74339999999999995},{"$f":"($FX$3*GT56+$HY$3*IV56+$KA$3*KX56+$MC$3*MY56)/(1000)","v":1.254423397285251},{"$f":"($FX$3*GV56+$HY$3*IX56+$KA$3*KZ56+$MC$3*NA56)/(1000)","v":0.93660454792022874},{"$f":"($FX$3*GU56+$HY$3*IW56+$KA$3*KY56+$MC$3*MZ56)/(1000)","v":0.64554794520547942},{"$f":"($FX$3*HA56+$HY$3*JC56+$KA$3*LE56+$MC$3*NF56)/(1000)","v":0.35},{"$f":"($FX$3*HB56+$HY$3*JD56+$KA$3*LF56+$MC$3*NG56)/(1000)","v":0.52500000000000002},{"$f":"($FX$3*HC56+$HY$3*JE56+$KA$3*LG56+$MC$3*NH56)/(1000)","v":0.875},0.12401999999999999,0.99902000000000002,0.58732876712328763,5.8219178082191785E-2,0,587.32876712328766,58.219178082191782,0,null,0.64554794520547942,0.64554794520547942,1.1612,null,null,null,null,null,null,null,null,null,null,null,null,null,null,null,null,null,null,null,null,null,null,166.80136986301309,16.534246575342408,0,null,null,null,null,null,null,null,null,null,null,100.34740948539853,0,117.28731024056681,0,390.14805057330642,0,117.44062698597934,0,725.22339728525105,725.22339728525105,529.19999999999993,1254.423397285251,205.96344482901054,1254.423397285251,null,null,null,null,null,null,null,null,null,null,null,null,null,null,null,null,null,null,null,null,null,null,null,null,null,null,null,null,null,null,null,null,null,null,null,null,null,null,null,null,null,null,null,null,null,null,null,null,null,null,null,null,null,null,null,null,null,null,null,null,null,null,null,null,null,null,null,null,null,null,null,null,null,null,null,null,null,null,null,null,null,null,2.5,350,525,875,283.99999999999898,2.5,350,525,875,0.56785714285714284,21,13.584745762711865,11.833050847457628,10.5,12.45,26.207861635220127,26.207861635220127,10.5,124.02,743.4,0,619.38,926.1,1254.423397285251,1545.48,1,1254.423397285251,645.54794520547944,936.6045479202287,875,525,350,350,350,525,875,99.399999999999636,149.09999999999948,248.49999999999909,61.604547920228697,0,356.25624482900997,265.99569160934402,17.495691609344885,657.47361643835382,875,149.09999999999948,null,211.12559999999922,175.90391999999937,null,null,null,2.5,350,525,875,283.99999999999898,2.5,214.17000000000007,321.25500000000011,535.42500000000018,0.56785714285714284,21,10.5,15.037500000000001,{"$f":"IF56+$GA$14/$GA$15*(IE56-IG56)","v":17.137499999999999},10.5,{"$f":"IH56+HZ56*IA56/(1.2*$GA$15)","v":25.556132075471702},25.556132075471702,0,10.5,422.14499999999987,743.4,0,321.25500000000011,926.1,1254.423397285251,{"$f":"IR56+IQ56","v":1247.355},0.99436522206095013,1247.355,645.54794520547944,645.54794520547978,645.54794520547978,321.25500000000011,258.21917808219189,214.17000000000007,214.17000000000007,321.25500000000011,535.42500000000018,60.824279999999803,91.236419999999711,152.06069999999949,110.1229452054796,0,354.24881999999872,183.3356164383556,31.27491643835609,657.47361643835382,0,91.236419999999711,null,211.12559999999922,91.236419999999711,null,null,null,{"$f":"JW55","v":2.5},350,525,875,283.99999999999898,2.5,214.17000000000007,321.25500000000011,535.42500000000018,{"$f":"KF55","v":0.56785714285714284},21,10.5,15.037500000000001,17.137499999999999,10.5,17.137499999999999,17.137499999999999,0,10.5,422.14499999999987,743.4,0,321.25500000000011,926.1,1254.423397285251,1247.355,0.99436522206095013,1247.355,645.54794520547944,645.54794520547978,645.54794520547978,321.25500000000011,258.21917808219189,214.17000000000007,214.17000000000007,321.25500000000011,535.42500000000018,60.824279999999803,91.236419999999711,152.06069999999949,110.1229452054796,0,354.24881999999872,183.3356164383556,31.27491643835609,657.47361643835382,0,91.236419999999711,null,211.12559999999922,91.236419999999711,null,null,null,2.5,350,525,875,283.99999999999898,2.5,350,525,875,0.56785714285714284,21,13.584745762711865,11.833050847457628,10.5,12.45,12.45,15,10.5,124.02,743.4,162.18000000000004,457.19999999999993,926.1,1254.423397285251,1383.3,1,1254.423397285251,645.54794520547944,936.6045479202287,875,525,350,350,350,525,875,99.399999999999636,149.09999999999948,248.49999999999909,61.604547920228697,46.059119999999844,356.25624482900997,265.99569160934402,17.495691609344885,657.47361643835382,162.18,149.09999999999948,2315.0479452054797,211.12559999999922,175.90391999999937]
[72.203196347031962,11.5,11.5,38707.199999999983,129.88993288590572,837.9,298.00000000000063,0.83789999999999998,2831.0000000000059,21,14.750197081775436,12.904549453195813,11.5,13.554588869550901,13.554588869550901,15,18.192803291576325,219.76787574440903,258.70808767123333,45.400124924614452,25.150124924614452,9.1928147896562659E-2,{"$f":"Y57-AG57-AA57-AF57","v":0},0.86814794520547922,2.1560479452054793,0.67259999999999998,1.2879,0.73747609310204221,0.64554794520547942,0.29499043724081692,0.4424856558612254,0.73747609310204221,0.13067185210343735,0.86814794520547955,0.58732876712328763,5.8219178082191785E-2,0,587.32876712328766,58.219178082191782,0,null,0.64554794520547942,0.64554794520547942,0.96007609310204223,null,null,null,null,null,null,null,null,null,null,null,null,null,null,null,null,null,null,null,null,null,null,175.02397260274009,17.349315068493187,0,null,null,null,null,null,null,null,null,null,null,119.1092631939061,0,139.21640006842182,0,463.09363718140816,0,139.39838229073348,0,860.8176827344696,860.8176827344696,529.19999999999993,1390.0176827344694,256.5236694548725,1390.0176827344694,null,null,null,null,null,null,null,null,null,null,null,null,null,null,null,null,null,null,null,null,null,null,null,null,null,null,null,null,null,null,null,null,null,null,null,null,null,null,null,null,null,null,null,null,null,null,null,null,null,null,null,null,null,null,null,null,null,null,null,null,null,null,null,null,null,null,null,null,null,null,null,null,null,null,null,null,null,null,null,null,null,null,2.5,350,525,875,298.00000000000063,2.5,258.2191780844297,387.32876712664455,645.54794521107419,0.56785714285714284,21,15.529254701601065,13.241213638906174,11.5,14.047064579226388,24.197189503928811,24.197189503928811,11.5,161.99330723879825,672.6,0,510.60669276120177,837.9,1390.0176827344694,1348.5066927612017,0.97013635834358125,{"$f":"GS57*GQ57","v":1348.5066927612017},645.54794520547944,645.54794520547966,645.54794520547966,525,{"$f":"GW57/FY57","v":258.21917808219189},350,258.21917808241568,387.32876712362349,645.54794520603923,76.94931506856004,115.42397260284005,192.37328767140008,-5.595666152657941E-10,0,401.85499444283897,192.37328767123333,0,642.50228767123428,645.54794521107408,115.42397260284005,null,200.43480000000042,152.16079444283844,null,null,null,2.5,350,525,875,298.00000000000063,2.5,193.77285714285713,290.65928571428572,484.43214285714282,0.56785714285714284,21,11.5,15.605357142857143,17.505357142857143,11.5,25.122214734950585,25.122214734950585,0,11.5,381.94071428571431,672.6,0,290.65928571428572,837.9,1390.0176827344694,1128.5592857142856,0.81190282665624947,1128.5592857142856,645.54794520547944,645.54794520547978,645.54794520547978,290.65928571428572,258.21917808219189,193.77285714285713,193.77285714285713,290.65928571428572,484.43214285714282,57.74431142857155,86.616467142857331,144.36077857142885,161.11580234833696,0,336.31066714285782,192.37328767123338,48.012509099804511,642.50228767123428,0,86.616467142857331,null,200.43480000000042,86.616467142857331,null,null,null,{"$f":"JW56","v":2.5},350,525,875,298.00000000000063,2.5,193.77285714285713,290.65928571428572,484.43214285714282,{"$f":"KF56","v":0.56785714285714284},21,11.5,15.605357142857143,17.505357142857143,11.5,17.505357142857143,17.505357142857143,0,11.5,381.94071428571431,672.6,0,290.65928571428572,837.9,1390.0176827344694,1128.5592857142856,0.81190282665624947,1128.5592857142856,645.54794520547944,645.54794520547978,645.54794520547978,290.65928571428572,258.21917808219189,193.77285714285713,193.77285714285713,290.65928571428572,484.43214285714282,57.74431142857155,86.616467142857331,144.36077857142885,161.11580234833696,0,336.31066714285782,192.37328767123338,48.012509099804511,642.50228767123428,0,86.616467142857331,null,200.43480000000042,86.616467142857331,null,null,null,2.5,350,525,875,298.00000000000063,2.5,294.99069774019944,442.48604661029913,737.47674435049862,0.56785714285714284,21,14.750197081775436,{"$f":"MAX(MJ57-MH57*(MJ57-ML57),$MN$17)","v":12.904549453195813},11.5,{"$f":"MIN(ML57+$GA$14/$GA$15*(MJ57-MK57),$MO$17)","v":13.554588869550901},13.554588869550901,15,11.5,130.67185210343735,672.6,91.928147896562663,450,837.9,1390.0176827344694,1287.9000000000001,0.9265349757755732,1287.9000000000001,645.54794520547944,737.47609310204223,737.47609310204223,525,294.9904372408169,350,294.9904372408169,442.48565586122538,737.47609310204223,87.907150297763621,131.86072544664546,219.76787574440903,0,27.394588073175729,383.79420000000084,219.76787574440903,0,642.50228767123428,91.928147896562621,131.86072544664546,2156.0479452054797,200.43480000000042,161.494588073176]
[75.525114155251146,12.5,12.5,38216.000000000015,{"$f":"D58/((A58-A57)/100*8760)","v":131.3264604810995},{"$f":"$F$21*(J58-B58)","v":749.7},{"$f":"(A58-A57)/100*8760","v":291.00000000000045},0.74970000000000003,2473.5000000000036,21,15.050927609848664,13.602365145684601,12.5,14.112550667654334,14.112550667654334,15,18.527580370438383,204.27900931811541,234.1234520547948,43.90012492461446,25.150124924614452,5.6441777537184344E-2,0,0.80454794520547912,1.9970479452054795,0.6018,1.1925000000000003,0.70198972274266358,0.64554794520547942,0.28079588909706549,0.4211938336455982,0.70198972274266358,0.10255822246281564,0.80454794520547923,0.58732876712328763,5.8219178082191785E-2,0,587.32876712328766,58.219178082191782,0,null,0.64554794520547942,0.64554794520547942,0.86098972274266361,null,null,null,null,null,null,null,null,null,null,null,null,null,null,null,null,null,null,null,null,null,null,{"$f":"AL58/1000*$G58","v":170.91267123287696},{"$f":"AM58/1000*$G58","v":16.941780821917835},{"$f":"AN58/1000*$G58","v":0},null,null,null,null,null,null,null,null,null,null,120.42656115241331,0,140.75607443700812,0,468.215256495463,0,140.94006930555327,0,{"$f":"SUM(CB58:CI58)","v":870.33796139043773},{"$f":"CJ58*24/(MAX($CB$12,10))","v":870.33796139043773},529.19999999999993,{"$f":"CK58+CL58","v":1399.5379613904377},{"$f":"CJ58*G58/1000","v":253.26834676461777},{"$f":"CM58","v":1399.5379613904377},null,null,null,null,null,null,null,null,null,null,null,null,null,null,null,null,null,null,null,null,null,null,null,null,null,null,null,null,null,null,null,null,null,null,null,null,null,null,null,null,null,null,null,null,null,null,null,null,null,null,null,null,null,null,null,null,null,null,null,null,null,null,null,null,null,null,null,null,null,null,null,null,null,null,null,null,null,null,null,null,null,null,2.5,350,{"$f":"FU58*(FT58-1+1E-50)","v":525},{"$f":"FT58*FU58","v":875},299.00000000000102,{"$f":"FT58","v":2.5},258.21917808310957,387.32876712466435,645.54794520777386,0.56785714285714284,21,{"$f":"MAX(GD58-GA58/(1.2*$GA$14),GK58)","v":15.529254701629036},{"$f":"MAX(GE58-GC58*(GE58-GG58),$GI$17)","v":13.809070781775405},12.5,{"$f":"MIN(GG58+$GA$14/$GA$15*(GE58-GF58),$GJ$17)","v":14.41492172210121},{"$f":"GH58+GB58/(1.2*$GA$15)","v":24.565046646751746},24.565046646751746,12.5,{"$f":"1.2*$GA$14*(GE58-GF58)","v":121.78902152563701},601.79999999999995,0,480.01097847436296,749.7,1399.5379613904377,{"$f":"GP58+GO58","v":1229.7109784743629},{"$f":"MIN(1/(GQ58/(GR58+1E-50)+1E-50),1)","v":0.87865496499476725},{"$f":"GS58*GQ58","v":1229.7109784743629},{"$f":"($AN$21=1)*AN58+($AL$21=1)*AL58+($AM$21=1)*AM58","v":645.54794520547944},645.54794520547944,{"$f":"MIN(FW58,GV58)","v":645.54794520547944},525,{"$f":"GW58/FY58","v":258.21917808219177},350,258.21917808228352,{"$f":"HA58*(FY58-1)","v":387.32876712342528},{"$f":"HA58*FY58","v":645.54794520570886},{"$f":"HA58/1000*$FX58","v":77.207534246603032},{"$f":"HB58/1000*$FX58","v":115.81130136990456},{"$f":"HC58/1000*$FX58","v":193.01883561650763},-2.2942003852222115E-10,{"$f":"GN58/1000*$FX58","v":0},{"$f":"GT58/1000*$FX58","v":367.68358256383578},{"$f":"GV58/1000*$FX58","v":193.01883561643902},0,597.11733561644041,645.54794520777398,{"$f":"HB58/1000*$FX58","v":115.81130136990456},null,{"$f":"GM58/1000*$FX58","v":179.93820000000062},{"$f":"(GM58-GL58)/1000*$FX58","v":143.52328256383501},null,null,null,{"$f":"HU57","v":2.5},350,{"$f":"HV58*(HU58-1+1E-50)","v":525},{"$f":"HU58*HV58","v":875},299.00000000000102,{"$f":"HU58","v":2.5},173.37571428571437,260.06357142857155,433.43928571428592,{"$f":"ID57","v":0.56785714285714284},21,12.5,{"$f":"MAX(IE58-ID58*(IE58-IF58),IL58)","v":16.173214285714288},{"$f":"IF58+$GA$14/$GA$15*(IE58-IG58)","v":17.873214285714283},{"$f":"MAX(IG58-IA58*(HZ58-1)/(1.2*$GA$14),IM58)","v":12.5},{"$f":"IH58+HZ58*IA58/(1.2*$GA$15)","v":24.688297394429469},{"$f":"MAX(IJ58,$IM$17)","v":24.688297394429469},0,12.5,{"$f":"1.2*$GA$14*(IE58-IG58)","v":341.73642857142841},601.79999999999995,0,260.06357142857155,749.7,1399.5379613904377,{"$f":"IR58+IQ58","v":1009.7635714285716},{"$f":"MIN(1/(IS58/(IT58+1E-50)+1E-50),1)","v":0.72149780805186148},{"$f":"IU58*IS58","v":1009.7635714285715},{"$f":"($AN$21=1)*AN58+($AL$21=1)*AL58+($AM$21=1)*AM58","v":645.54794520547944},645.54794520547955,645.54794520547955,260.06357142857155,{"$f":"IY58/HZ58","v":258.21917808219183},173.37571428571437,173.37571428571437,{"$f":"JC58*(HZ58-1)","v":260.06357142857155},{"$f":"JC58*HZ58","v":433.43928571428592},{"$f":"JC58/1000*$HY58","v":51.839338571428769},{"$f":"JD58/1000*$HY58","v":77.75900785714316},{"$f":"JE58/1000*$HY58","v":129.59834642857194},212.10865949119363,{"$f":"IP58/1000*$HY58","v":0},{"$f":"IV58/1000*$HY58","v":301.91930785714391},{"$f":"IX58/1000*$HY58","v":193.01883561643905},63.420489187867119,597.11733561644041,0,{"$f":"JD58/1000*$HY58","v":77.75900785714316},null,{"$f":"IO58/1000*$HY58","v":179.93820000000062},{"$f":"(IO58-IN58)/1000*$HY58","v":77.75900785714316},null,null,null,{"$f":"JW57","v":2.5},350,{"$f":"JX58*(JW58-1+1E-50)","v":525},{"$f":"JW58*JX58","v":875},299.00000000000102,{"$f":"JW58","v":2.5},173.37571428571437,260.06357142857155,433.43928571428592,{"$f":"KF57","v":0.56785714285714284},21,12.5,{"$f":"MAX(KG58-KF58*(KG58-KH58),KN58)","v":16.173214285714288},{"$f":"KH58+$GA$14/$GA$15*(KG58-KI58)","v":17.873214285714283},{"$f":"MAX(KI58-KC58*(KB58-1)/(1.2*$GA$14),KO58)","v":12.5},{"$f":"KJ58+0*(KJ58+KB58*KC58/(1.2*$GA$15))","v":17.873214285714283},{"$f":"MAX(KL58,$IM$17)","v":17.873214285714283},0,12.5,{"$f":"1.2*$GA$14*(KG58-KI58)","v":341.73642857142841},601.79999999999995,{"$f":"1.2*$GA$15*(KM58-KL58)","v":0},{"$f":"KQ58-KP58-KR58","v":260.06357142857155},749.7,1399.5379613904377,{"$f":"KT58+KS58","v":1009.7635714285716},{"$f":"MIN(1/(KU58/(KV58+1E-50)+1E-50),1)","v":0.72149780805186148},{"$f":"KW58*KU58","v":1009.7635714285715},{"$f":"($AN$21=1)*AN58+($AL$21=1)*AL58+($AM$21=1)*AM58","v":645.54794520547944},645.54794520547955,645.54794520547955,260.06357142857155,{"$f":"LA58/KB58","v":258.21917808219183},173.37571428571437,173.37571428571437,{"$f":"LE58*(KB58-1)","v":260.06357142857155},{"$f":"LE58*KB58","v":433.43928571428592},{"$f":"LE58/1000*$KA58","v":51.839338571428769},{"$f":"LF58/1000*$KA58","v":77.75900785714316},{"$f":"LG58/1000*$KA58","v":129.59834642857194},212.10865949119363,{"$f":"KR58/1000*$KA58","v":0},{"$f":"KX58/1000*$KA58","v":301.91930785714391},{"$f":"KZ58/1000*$KA58","v":193.01883561643905},63.420489187867119,597.11733561644041,0,{"$f":"LF58/1000*$KA58","v":77.75900785714316},null,{"$f":"KQ58/1000*$KA58","v":179.93820000000062},{"$f":"(KQ58-KP58)/1000*$KA58","v":77.75900785714316},null,null,null,{"$f":"LY57","v":2.5},350,{"$f":"LZ58*(LY58-1+1E-50)","v":525},{"$f":"LY58*LZ58","v":875},299.00000000000102,{"$f":"LY58","v":2.5},280.796216815143,421.1943252227145,701.99054203785749,{"$f":"MH57","v":0.56785714285714284},21,{"$f":"MAX(MI58-MF58/(1.2*$GA$14),MP58)","v":15.050927609848664},{"$f":"MAX(MJ58-MH58*(MJ58-ML58),$MN$17)","v":13.602365145684601},12.5,{"$f":"MIN(ML58+$GA$14/$GA$15*(MJ58-MK58),$MO$17)","v":14.112550667654334},{"$f":"MM58+0*(MM58+MG58/(1.2*$GA$15))","v":14.112550667654334},{"$f":"MAX(MN58,$MQ$17)","v":15},12.5,{"$f":"1.2*$GA$14*(MJ58-MK58)","v":102.55822246281564},601.79999999999995,{"$f":"1.2*$GA$15*(MO58-MN58)","v":56.441777537184343},{"$f":"MR58-MQ58-MS58","v":442.79999999999995},749.7,1399.5379613904377,{"$f":"MU58+MT58","v":1192.5},{"$f":"MIN(1/(MV58/(MW58+1E-50)+1E-50),1)","v":0.85206691986779282},{"$f":"MX58*MV58","v":1192.5000000000002},{"$f":"($AN$21=1)*AN58+($AL$21=1)*AL58+($AM$21=1)*AM58","v":645.54794520547944},701.98972274266362,701.98972274266362,525,{"$f":"NB58/MD58","v":280.79588909706547},350,280.79588909706547,{"$f":"NF58*(MD58-1)","v":421.1938336455982},{"$f":"NF58*MD58","v":701.98972274266362},{"$f":"NF58/1000*$MC58","v":83.957970840022867},{"$f":"NG58/1000*$MC58","v":125.93695626003429},{"$f":"NH58/1000*$MC58","v":209.89492710005712},0,{"$f":"MS58/1000*$MC58","v":16.876091483618175},{"$f":"MY58/1000*$MC58","v":356.55750000000131},{"$f":"NA58/1000*$MC58","v":209.89492710005712},0,597.11733561644041,56.441777537184365,{"$f":"NG58/1000*$MC58","v":125.93695626003429},1997.0479452054794,{"$f":"MR58/1000*$MC58","v":179.93820000000062},{"$f":"(MR58-MQ58)/1000*$MC58","v":149.27329148361861}]
[79.109589041095902,13.5,13.5,47382.7,150.90031847133727,661.5,314.00000000000063,0.66149999999999998,2355.0000000000045,21,15.351658137921884,14.300180838173386,13.5,14.670512465757762,14.670512465757762,15,18.86235744930044,209.28205264835216,232.65765479452094,42.40012492461446,25.150124924614452,2.0955407177806355E-2,0,0.74094794520547924,1.8380479452054792,0.53100000000000003,1.0971,0.66650335238328584,0.64554794520547942,0.26660134095331434,0.3999020114299715,0.66650335238328584,7.4444592822193664E-2,0.74094794520547946,0.58732876712328763,5.8219178082191785E-2,0,587.32876712328766,58.219178082191782,0,null,0.64554794520547942,0.64554794520547942,0.76190335238328577,null,null,null,null,null,null,null,null,null,null,null,null,null,null,null,null,null,null,null,null,null,null,184.42123287671268,18.280821917808257,0,null,null,null,null,null,null,null,null,null,null,{"$f":"CB$23*$E59*CB$21*CB$20","v":138.37581827557528},0,161.73539118856144,0,538.00148926173745,0,161.94681000057264,0,1000.0595087264469,1000.0595087264469,529.19999999999993,1529.2595087264467,314.01868574010496,1529.2595087264467,null,null,null,null,null,null,null,null,null,null,null,null,null,null,null,null,null,null,null,null,null,null,null,null,null,null,null,null,null,null,null,null,null,null,null,null,null,null,null,null,null,null,null,null,null,null,null,null,null,null,null,null,null,null,null,null,null,null,null,null,null,null,null,null,null,null,null,null,null,null,null,null,null,null,null,null,null,null,null,null,null,null,2.5,350,525,875,300.00000000000102,2.5,258.21917808310963,387.32876712466441,645.54794520777409,0.56785714285714284,21,15.529254701629034,14.376927924632547,13.5,14.782778864958354,24.932903789608893,24.932903789608893,13.5,81.58473581135128,531,0,449.41526418864873,661.5,1529.2595087264467,1110.9152641886487,0.72643999128297643,1110.9152641886487,645.54794520547944,645.54794520547944,645.54794520547944,525,258.21917808219177,350,258.21917808228352,387.32876712342528,645.54794520570886,77.465753424685317,116.19863013702798,193.66438356171332,-2.2942003852222115E-10,0,333.27457925659581,193.66438356164448,0,551.41438356164576,645.54794520777432,116.19863013702798,null,159.30000000000055,134.82457925659509,null,null,null,{"$f":"HU58","v":2.5},350,525,875,300.00000000000102,2.5,152.97857142857151,229.46785714285727,382.44642857142878,{"$f":"ID58","v":0.56785714285714284},21,13.5,16.741071428571431,18.241071428571427,13.5,24.254380053908356,24.254380053908356,0,13.5,301.53214285714267,531,0,229.46785714285733,661.5,1529.2595087264467,890.96785714285738,0.58261390696523918,890.96785714285738,645.54794520547944,645.54794520547944,645.54794520547944,229.46785714285727,258.21917808219177,152.97857142857151,152.97857142857151,229.46785714285727,382.44642857142878,45.893571428571612,68.840357142857414,114.73392857142903,263.10151663405065,0,267.29035714285811,193.66438356164448,78.93045499021548,551.41438356164576,0,68.840357142857414,null,159.30000000000055,68.840357142857428,null,null,null,{"$f":"JW58","v":2.5},350,525,875,300.00000000000102,2.5,152.97857142857151,229.46785714285727,382.44642857142878,{"$f":"KF58","v":0.56785714285714284},21,13.5,16.741071428571431,18.241071428571427,13.5,18.241071428571427,18.241071428571427,0,13.5,301.53214285714267,531,0,229.46785714285733,661.5,1529.2595087264467,890.96785714285738,0.58261390696523918,890.96785714285738,645.54794520547944,645.54794520547944,645.54794520547944,229.46785714285727,258.21917808219177,152.97857142857151,152.97857142857151,229.46785714285727,382.44642857142878,45.893571428571612,68.840357142857414,114.73392857142903,263.10151663405065,0,267.29035714285811,193.66438356164448,78.93045499021548,551.41438356164576,0,68.840357142857414,null,159.30000000000055,68.840357142857428,null,null,null,{"$f":"LY58","v":2.5},350,525,875,300.00000000000102,2.5,266.60173589008701,399.90260383513055,666.50433972521751,{"$f":"MH58","v":0.56785714285714284},21,15.351658137921884,14.300180838173386,13.5,14.670512465757762,14.670512465757762,15,13.5,74.44459282219367,531,20.955407177806354,435.59999999999997,661.5,1529.2595087264467,1097.0999999999999,0.71740603458052365,1097.0999999999999,645.54794520547944,666.5033523832858,666.5033523832858,525,266.60134095331432,350,266.60134095331432,399.90201142997148,666.5033523832858,79.980402285994572,119.97060342899186,199.95100571498642,0,6.286622153341928,329.13000000000113,199.95100571498642,0,551.41438356164576,20.955407177806322,119.97060342899186,1838.0479452054794,159.30000000000055,136.96662215334237]
[82.659817351598178,14.5,14.5,54085.3,173.90771704180094,573.30000000000007,310.99999999999949,0.57330000000000003,2021.4999999999966,21,15.52925470164848,14.944785067498094,14.5,15.150636007827789,15.150636007827789,15.150636007827789,19.21068597767357,200.76541095890371,213.63473093933419,40.90012492461446,25.300760932442241,0,0,0.6869283953033265,1.6790479452054794,0.4602,0.9921195499021529,0.6455479452054792,0.64554794520547942,0.25821917808219164,0.38732876712328751,0.6455479452054792,4.1380450097847313E-2,0.6869283953033265,0.58732876712328763,5.8219178082191785E-2,0,587.32876712328766,58.219178082191782,0,null,0.64554794520547942,0.64554794520547942,0.6869283953033265,null,null,null,null,null,null,null,null,null,null,null,null,null,null,null,null,null,null,null,null,null,null,182.65924657534217,18.106164383561616,0,null,null,null,null,null,null,null,null,null,null,159.47363725854137,0,186.39478651470114,0,620.02924652786248,0,186.63843983040664,0,1152.5361101315116,1152.5361101315116,529.19999999999993,1681.7361101315114,358.43873025089948,1681.7361101315114,null,null,null,null,null,null,null,null,null,null,null,null,null,null,null,null,null,null,null,null,null,null,null,null,null,null,null,null,null,null,null,null,null,null,null,null,null,null,null,null,null,null,null,null,null,null,null,null,null,null,null,null,null,null,null,null,null,null,null,null,null,null,null,null,null,null,null,null,null,null,null,null,null,null,null,null,null,null,null,null,null,null,2.5,350,525,875,301.00000000000102,2.5,258.21917808310957,387.32876712466435,645.54794520777386,0.56785714285714284,21,15.529254701629036,14.94478506748969,14.5,15.150636007815498,25.300760932466034,25.300760932466034,14.5,41.380450097065683,460.2,0,418.81954990293428,573.30000000000007,1681.7361101315114,992.1195499029343,0.58993771015914664,992.1195499029343,645.54794520547944,645.54794520547944,645.54794520547944,460.2,258.21917808219177,306.8,258.21917808228352,387.32876712342528,645.54794520570886,77.723972602767603,116.58595890415141,194.30993150691904,-2.2942003852222115E-10,0,298.62798452078425,194.30993150684998,0,505.39343150685102,{"$f":"MAX(1.2*$GA$15*(GJ60-GG60)-GL60,0)","v":645.54794520777398},116.58595890415141,null,138.52020000000047,126.06468452078366,null,null,null,{"$f":"HU59","v":2.5},350,525,875,301.00000000000102,2.5,132.58142857142852,198.87214285714276,331.45357142857131,{"$f":"ID59","v":0.56785714285714284},21,14.5,17.30892857142857,18.608928571428571,14.5,23.82046271338724,23.82046271338724,0,14.5,261.32785714285723,460.2,0,198.87214285714276,573.30000000000007,1681.7361101315114,772.17214285714283,0.45915178856257011,772.17214285714283,645.54794520547944,645.54794520547944,645.54794520547944,198.87214285714276,258.21917808219177,132.58142857142852,132.58142857142852,198.87214285714276,331.45357142857131,39.90701000000012,59.860515000000177,99.767525000000305,314.09437377690813,0,232.42381500000079,194.30993150684998,94.542406506849673,505.39343150685102,0,59.860515000000177,null,138.52020000000047,59.860515000000177,null,null,null,{"$f":"JW59","v":2.5},350,525,875,301.00000000000102,2.5,132.58142857142852,198.87214285714276,331.45357142857131,{"$f":"KF59","v":0.56785714285714284},21,14.5,17.30892857142857,18.608928571428571,14.5,18.608928571428571,18.608928571428571,0,14.5,261.32785714285723,460.2,0,198.87214285714276,573.30000000000007,1681.7361101315114,772.17214285714283,0.45915178856257011,772.17214285714283,645.54794520547944,645.54794520547944,645.54794520547944,198.87214285714276,258.21917808219177,132.58142857142852,132.58142857142852,198.87214285714276,331.45357142857131,39.90701000000012,59.860515000000177,99.767525000000305,314.09437377690813,0,232.42381500000079,194.30993150684998,94.542406506849673,505.39343150685102,0,59.860515000000177,null,138.52020000000047,59.860515000000177,null,null,null,{"$f":"LY59","v":2.5},350,525,875,301.00000000000102,2.5,258.21917808219177,387.32876712328766,645.54794520547944,{"$f":"MH59","v":0.56785714285714284},21,15.52925470164848,14.944785067498094,14.5,15.150636007827789,15.150636007827789,15.150636007827789,14.5,41.380450097847316,460.2,0,418.81954990215269,573.30000000000007,1681.7361101315114,992.11954990215281,0.58993771015868202,992.11954990215293,645.54794520547944,645.54794520547921,645.54794520547921,460.2,258.21917808219166,306.8,258.21917808219166,387.32876712328749,645.54794520547921,77.723972602739948,116.58595890410993,194.30993150684989,0,0,298.62798452054903,194.30993150684989,0,505.39343150685102,0,116.58595890410993,1679.0479452054794,138.52020000000047,126.0646845205484]
[85.947488584474883,15.5,15.5,57081.19999999999,198.19861111111155,485.1,287.99999999999932,0.48510000000000003,1583.9999999999964,21,15.529254701648478,15.512642210355235,15.5,15.518493150684931,15.518493150684931,15.518493150684931,19.578543120530714,185.91780821917766,186.25654356164347,39.40012492461446,25.668618075299392,0,0,0.64672410958904136,1.5200479452054796,0.38939999999999997,0.87332383561643823,0.64554794520547953,0.64554794520547942,0.25821917808219186,0.38732876712328779,0.64554794520547953,1.1761643835615919E-3,0.64672410958904114,0.58732876712328763,5.8219178082191785E-2,0,587.32876712328766,58.219178082191782,0,null,0.64554794520547942,0.64554794520547942,0.64672410958904114,null,null,null,null,null,null,null,null,null,null,null,null,null,null,null,null,null,null,null,null,null,null,169.15068493150645,16.767123287671193,0,null,null,null,null,null,null,null,null,null,null,181.74842353823126,0,212.4298359726391,0,706.63302123938172,0,212.70752203273409,0,1313.5188027829861,1313.5188027829861,529.19999999999993,1842.7188027829861,378.29341520149904,1842.7188027829861,null,null,null,null,null,null,null,null,null,null,null,null,null,null,null,null,null,null,null,null,null,null,null,null,null,null,null,null,null,null,null,null,null,null,null,null,null,null,null,null,null,null,null,null,null,null,null,null,null,null,null,null,null,null,null,null,null,null,null,null,null,null,null,null,null,null,null,null,null,null,null,null,null,null,null,null,null,null,null,null,null,null,2.5,350,525,875,302.00000000000102,2.5,258.21917808310963,387.32876712466441,645.54794520777409,0.56785714285714284,21,15.529254701629034,15.512642210346833,15.5,15.518493150672638,25.668618075323174,25.668618075323174,15.5,1.1761643827798303,389.4,0,388.22383561722017,485.1,1842.7188027829861,873.3238356172202,0.47393223225283931,873.3238356172202,645.54794520547944,645.54794520547944,645.54794520547944,389.4,258.21917808219177,259.59999999999997,258.21917808228352,387.32876712342528,645.54794520570886,77.982191780849888,116.97328767127483,194.95547945212476,-2.2942003852222115E-10,0,263.74379835640138,194.95547945205544,0,459.05447945205634,645.54794520777398,116.97328767127483,null,117.5988000000004,117.24359835640089,null,null,null,{"$f":"HU60","v":2.5},350,525,875,302.00000000000102,2.5,112.18428571428565,168.27642857142848,280.46071428571412,{"$f":"ID60","v":0.56785714285714284},21,15.5,17.876785714285713,18.976785714285715,15.5,23.386545372866124,23.386545372866124,0,15.5,221.12357142857149,389.4,0,168.27642857142848,485.1,1842.7188027829861,653.37642857142851,0.35457196593677753,653.37642857142839,645.54794520547944,645.54794520547955,645.54794520547955,168.27642857142848,258.21917808219183,112.18428571428565,112.18428571428565,168.27642857142848,280.46071428571412,33.879654285714381,50.819481428571578,84.699135714285944,365.08723091976543,0,197.31968142857204,194.95547945205547,110.25634373776953,459.05447945205634,0,50.819481428571578,null,117.5988000000004,50.819481428571578,null,null,null,{"$f":"JW60","v":2.5},350,525,875,302.00000000000102,2.5,112.18428571428565,168.27642857142848,280.46071428571412,{"$f":"KF60","v":0.56785714285714284},21,15.5,17.876785714285713,18.976785714285715,15.5,18.976785714285715,18.976785714285715,0,15.5,221.12357142857149,389.4,0,168.27642857142848,485.1,1842.7188027829861,653.37642857142851,0.35457196593677753,653.37642857142839,645.54794520547944,645.54794520547955,645.54794520547955,168.27642857142848,258.21917808219183,112.18428571428565,112.18428571428565,168.27642857142848,280.46071428571412,33.879654285714381,50.819481428571578,84.699135714285944,365.08723091976543,0,197.31968142857204,194.95547945205547,110.25634373776953,459.05447945205634,0,50.819481428571578,null,117.5988000000004,50.819481428571578,null,null,null,{"$f":"LY60","v":2.5},350,525,875,302.00000000000102,2.5,258.21917808219183,387.32876712328778,645.54794520547955,{"$f":"MH60","v":0.56785714285714284},21,15.529254701648478,15.512642210355235,15.5,15.518493150684931,15.518493150684931,15.518493150684931,15.5,1.176164383561592,389.4,0,388.22383561643841,485.1,1842.7188027829861,873.32383561643837,0.47393223225241499,873.32383561643826,645.54794520547944,645.54794520547955,645.54794520547955,389.4,258.21917808219183,259.59999999999997,258.21917808219183,387.32876712328778,645.54794520547955,77.982191780822205,116.97328767123331,194.95547945205547,0,0,263.74379835616526,194.95547945205547,0,459.05447945205634,0,116.97328767123331,1520.0479452054794,117.5988000000004,117.2435983561648]
[89.292237442922371,16.5,16.5,70692.699999999983,241.27201365187707,396.90000000000003,293,0.39690000000000003,1318.5,21,16.5,16.5,16.5,16.5,16.5,16.5,19.839622641509433,155.583,189.14554794520546,37.90012492461446,26.65012492461446,0,0.11454794520547928,0.64554794520547942,1.3610479452054793,0.31859999999999994,0.71550000000000002,0.64554794520547942,0.64554794520547942,0.21239999999999998,0.31859999999999994,0.53100000000000003,0,0.53100000000000003,0.58732876712328763,5.8219178082191785E-2,0,587.32876712328766,58.219178082191782,0,null,0.64554794520547942,0.64554794520547942,0.53100000000000003,null,null,null,null,null,null,null,null,null,null,null,null,null,null,null,null,null,null,null,null,null,null,172.08732876712327,17.058219178082194,0,null,null,null,null,null,null,null,null,null,null,221.24679824592818,0,258.59603151367997,0,860.20164819296815,0,258.9340655418024,0,1598.9785434943788,1598.9785434943788,529.19999999999993,2128.1785434943786,468.50071324385294,2128.1785434943786,null,null,null,null,null,null,null,null,null,null,null,null,null,null,null,null,null,null,null,null,null,null,null,null,null,null,null,null,null,null,null,null,null,null,null,null,null,null,null,null,null,null,null,null,null,null,null,null,null,null,null,null,null,null,null,null,null,null,null,null,null,null,null,null,null,null,null,null,null,null,null,null,null,null,null,null,null,null,null,null,null,null,2.5,350,525,875,303.00000000000102,2.5,212.40000000137599,318.60000000206401,531.00000000343994,0.56785714285714284,21,16.5,16.5,16.5,16.5,24.849056603827673,24.849056603827673,16.5,0,318.59999999999997,0,318.59999999999997,396.90000000000003,2128.1785434943786,715.5,0.33620299489777744,715.5,645.54794520547944,645.54794520547944,645.54794520547944,318.59999999999997,258.21917808219177,212.39999999999998,212.4000000001376,318.60000000020636,531.00000000034402,64.357200000041914,96.535800000062864,160.89300000010476,114.54794520513542,0,216.79650000000075,195.60102739726094,34.708027397156151,412.39752739726163,531.00000000343994,96.535800000062864,null,96.535800000000307,96.535800000000307,null,null,null,{"$f":"HU61","v":2.5},350,525,875,303.00000000000102,2.5,91.787142857142797,137.6807142857142,229.46785714285699,{"$f":"ID61","v":0.56785714285714284},21,16.5,18.444642857142856,19.344642857142858,16.5,22.952628032345011,22.952628032345011,0,16.5,180.91928571428576,318.59999999999997,0,137.6807142857142,396.90000000000003,2128.1785434943786,534.58071428571429,0.25119166618791089,534.58071428571429,645.54794520547944,645.54794520547944,645.54794520547944,137.6807142857142,258.21917808219177,91.787142857142797,91.787142857142797,137.6807142857142,229.46785714285699,27.811504285714364,41.717256428571545,69.528760714285895,416.08008806262245,0,161.97795642857199,195.60102739726094,126.07226668297504,412.39752739726163,0,41.717256428571545,null,96.535800000000307,41.717256428571545,null,null,null,{"$f":"JW61","v":2.5},350,525,875,303.00000000000102,2.5,91.787142857142797,137.6807142857142,229.46785714285699,{"$f":"KF61","v":0.56785714285714284},21,16.5,18.444642857142856,19.344642857142858,16.5,19.344642857142858,19.344642857142858,0,16.5,180.91928571428576,318.59999999999997,0,137.6807142857142,396.90000000000003,2128.1785434943786,534.58071428571429,0.25119166618791089,534.58071428571429,645.54794520547944,645.54794520547944,645.54794520547944,137.6807142857142,258.21917808219177,91.787142857142797,91.787142857142797,137.6807142857142,229.46785714285699,27.811504285714364,41.717256428571545,69.528760714285895,416.08008806262245,0,161.97795642857199,195.60102739726094,126.07226668297504,412.39752739726163,0,41.717256428571545,null,96.535800000000307,41.717256428571545,null,null,null,{"$f":"LY61","v":2.5},350,525,875,303.00000000000102,2.5,212.39999999999998,318.59999999999997,531,{"$f":"MH61","v":0.56785714285714284},21,16.5,16.5,16.5,16.5,16.5,16.5,16.5,0,318.59999999999997,0,318.59999999999997,396.90000000000003,2128.1785434943786,715.5,0.33620299489777744,715.5,645.54794520547944,645.54794520547944,645.54794520547944,318.59999999999997,258.21917808219177,212.39999999999998,212.39999999999998,318.59999999999997,531,64.357200000000205,96.535800000000307,160.89300000000054,114.54794520547944,0,216.79650000000075,195.60102739726094,34.708027397260388,412.39752739726163,0,96.535800000000307,1361.0479452054794,96.535800000000307,96.535800000000307]
[91.769406392694066,17.5,17.5,47382.7,218.35345622119766,308.7,217.00000000000048,0.30869999999999997,759.50000000000171,21,17.5,17.5,17.5,17.5,17.5,17.5,20.09748427672956,89.621000000000194,140.08390410958938,36.40012492461446,27.65012492461446,0,0.23254794520547956,0.64554794520547953,1.2020479452054795,0.24779999999999999,0.55649999999999999,0.64554794520547942,0.64554794520547942,0.16519999999999999,0.24779999999999999,0.41299999999999998,0,0.41299999999999998,0.58732876712328763,5.8219178082191785E-2,0,587.32876712328766,58.219178082191782,0,null,0.64554794520547942,0.64554794520547942,0.41299999999999998,null,null,null,null,null,null,null,null,null,null,null,null,null,null,null,null,null,null,null,null,null,null,127.45034246575371,12.633561643835645,0,null,null,null,null,null,null,null,null,null,null,200.23044672133929,0,234.03185637423167,0,778.49063423126961,0,234.33778036949215,0,1447.0907176963326,1447.0907176963326,529.19999999999993,1976.2907176963326,314.0186857401049,1976.2907176963326,null,null,null,null,null,null,null,null,null,null,null,null,null,null,null,null,null,null,null,null,null,null,null,null,null,null,null,null,null,null,null,null,null,null,null,null,null,null,null,null,null,null,null,null,null,null,null,null,null,null,null,null,null,null,null,null,null,null,null,null,null,null,null,null,null,null,null,null,null,null,null,null,null,null,null,null,null,null,null,null,null,null,2.5,350,525,875,304.00000000000102,2.5,165.200000001848,247.80000000277198,413.00000000462001,0.56785714285714284,21,17.5,17.5,17.5,17.5,23.993710691896542,23.993710691896542,17.5,0,247.79999999999998,0,247.79999999999998,308.7,1976.2907176963326,556.5,0.28158812618858292,556.5,645.54794520547944,645.54794520547944,645.54794520547944,247.79999999999998,258.21917808219177,165.2,165.20000000018482,247.80000000027724,413.00000000046202,50.22080000005635,75.331200000084536,125.55200000014086,232.54794520501741,0,169.17600000000056,196.2465753424664,70.694575342325535,365.42257534246698,413.00000000462001,75.331200000084536,null,75.331200000000251,75.331200000000251,null,null,null,{"$f":"HU62","v":2.5},350,525,875,304.00000000000102,2.5,71.389999999999972,107.08499999999995,178.47499999999994,{"$f":"ID62","v":0.56785714285714284},21,17.5,19.012499999999999,19.712500000000002,17.5,22.518710691823902,22.518710691823902,0,17.5,140.71500000000003,247.79999999999998,0,107.08499999999995,308.7,1976.2907176963326,415.78499999999997,0.21038655713804119,415.78499999999991,645.54794520547944,645.54794520547955,645.54794520547955,107.08499999999995,258.21917808219183,71.389999999999972,71.389999999999972,107.08499999999995,178.47499999999994,21.702560000000062,32.553840000000093,54.256400000000163,467.07294520547964,0,126.3986400000004,196.24657534246643,141.9901753424663,365.42257534246698,0,32.553840000000093,null,75.331200000000251,32.553840000000093,null,null,null,{"$f":"JW62","v":2.5},350,525,875,304.00000000000102,2.5,71.389999999999972,107.08499999999995,178.47499999999994,{"$f":"KF62","v":0.56785714285714284},21,17.5,19.012499999999999,19.712500000000002,17.5,19.712500000000002,19.712500000000002,0,17.5,140.71500000000003,247.79999999999998,0,107.08499999999995,308.7,1976.2907176963326,415.78499999999997,0.21038655713804119,415.78499999999991,645.54794520547944,645.54794520547955,645.54794520547955,107.08499999999995,258.21917808219183,71.389999999999972,71.389999999999972,107.08499999999995,178.47499999999994,21.702560000000062,32.553840000000093,54.256400000000163,467.07294520547964,0,126.3986400000004,196.24657534246643,141.9901753424663,365.42257534246698,0,32.553840000000093,null,75.331200000000251,32.553840000000093,null,null,null,{"$f":"LY62","v":2.5},350,525,875,304.00000000000102,2.5,165.2,247.79999999999998,413,{"$f":"MH62","v":0.56785714285714284},21,17.5,17.5,17.5,17.5,17.5,17.5,17.5,0,247.79999999999998,0,247.79999999999998,308.7,1976.2907176963326,556.5,0.28158812618858292,556.5,645.54794520547944,645.54794520547944,645.54794520547944,247.79999999999998,258.21917808219177,165.2,165.2,247.79999999999998,413,50.220800000000168,75.331200000000251,125.55200000000042,232.54794520547944,0,169.17600000000056,196.2465753424664,70.694575342465996,365.42257534246698,0,75.331200000000251,1202.0479452054794,75.331200000000251,75.331200000000251]
[93.664383561643831,18.5,18.5,57830.299999999945,348.37530120482012,220.5,165.99999999999943,0.2205,414.99999999999858,21,18.5,18.5,18.5,18.5,18.5,18.5,20.355345911949687,48.969999999999828,107.16095890410922,34.90012492461446,28.65012492461446,0,0.35054794520547933,0.64554794520547942,1.0430479452054793,0.17699999999999999,0.39750000000000002,0.64554794520547942,0.64554794520547942,0.11799999999999999,0.17699999999999999,0.29499999999999998,0,0.29499999999999998,0.58732876712328763,5.8219178082191785E-2,0,587.32876712328766,58.219178082191782,0,null,0.64554794520547942,0.64554794520547942,0.29499999999999998,null,null,null,null,null,null,null,null,null,null,null,null,null,null,null,null,null,null,null,null,null,null,97.49657534246542,9.6643835616438025,0,null,null,null,null,null,null,null,null,null,null,319.46067350662094,0,373.38964020474793,0,1242.0545746283515,0,373.87773123769529,0,2308.7826195774155,2308.7826195774155,529.19999999999993,2837.9826195774153,383.25791484984967,2837.9826195774153,null,null,null,null,null,null,null,null,null,null,null,null,null,null,null,null,null,null,null,null,null,null,null,null,null,null,null,null,null,null,null,null,null,null,null,null,null,null,null,null,null,null,null,null,null,null,null,null,null,null,null,null,null,null,null,null,null,null,null,null,null,null,null,null,null,null,null,null,null,null,null,null,null,null,null,null,null,null,null,null,null,null,2.5,350,525,875,305.00000000000102,2.5,118.00000000232001,177.00000000348001,295.00000000580002,0.56785714285714284,21,18.5,18.5,18.5,18.5,23.138364779965411,23.138364779965411,18.5,0,177,0,177,220.5,2837.9826195774153,397.5,0.14006428272601226,397.5,645.54794520547944,645.54794520547944,645.54794520547944,177,258.21917808219177,118,118.00000000023201,177.000000000348,295.00000000058003,35.990000000070879,53.985000000106318,89.975000000177204,350.54794520489941,0,121.23750000000041,196.89212328767189,106.91712328749468,318.1296232876723,295.00000000580008,53.985000000106318,null,53.985000000000177,53.985000000000177,null,null,null,{"$f":"HU63","v":2.5},350,525,875,305.00000000000102,2.5,50.992857142857112,76.489285714285671,127.48214285714278,{"$f":"ID63","v":0.56785714285714284},21,18.5,19.580357142857142,20.080357142857142,18.5,22.084793351302785,22.084793351302785,0,18.5,100.51071428571431,177,0,76.489285714285685,220.5,2837.9826195774153,296.9892857142857,0.10464802837957772,296.9892857142857,645.54794520547944,645.54794520547944,645.54794520547944,76.489285714285671,258.21917808219177,50.992857142857112,50.992857142857112,76.489285714285671,127.48214285714278,15.552821428571471,23.329232142857208,38.882053571428671,518.06580234833666,0,90.581732142857433,196.89212328767189,158.01006971624321,318.1296232876723,0,23.329232142857208,null,53.985000000000177,23.329232142857215,null,null,null,{"$f":"JW63","v":2.5},350,525,875,305.00000000000102,2.5,50.992857142857112,76.489285714285671,127.48214285714278,{"$f":"KF63","v":0.56785714285714284},21,18.5,19.580357142857142,20.080357142857142,18.5,20.080357142857142,20.080357142857142,0,18.5,100.51071428571431,177,0,76.489285714285685,220.5,2837.9826195774153,296.9892857142857,0.10464802837957772,296.9892857142857,645.54794520547944,645.54794520547944,645.54794520547944,76.489285714285671,258.21917808219177,50.992857142857112,50.992857142857112,76.489285714285671,127.48214285714278,15.552821428571471,23.329232142857208,38.882053571428671,518.06580234833666,0,90.581732142857433,196.89212328767189,158.01006971624321,318.1296232876723,0,23.329232142857208,null,53.985000000000177,23.329232142857215,null,null,null,{"$f":"LY63","v":2.5},350,525,875,305.00000000000102,2.5,118,177,295,{"$f":"MH63","v":0.56785714285714284},21,18.5,18.5,18.5,18.5,18.5,18.5,18.5,0,177,0,177,220.5,2837.9826195774153,397.5,0.14006428272601226,397.5,645.54794520547944,645.54794520547944,645.54794520547944,177,258.21917808219177,118,118,177,295,35.990000000000116,53.985000000000177,89.975000000000293,350.54794520547944,0,121.23750000000041,196.89212328767189,106.91712328767159,318.1296232876723,0,53.985000000000177,1043.0479452054794,53.985000000000177,53.985000000000177]
[95.479452054794521,19.5,19.5,64114.6,403.23647798742013,132.30000000000001,159.00000000000048,0.1323,238.50000000000074,21,19.5,19.5,19.5,19.5,19.5,19.5,20.613207547169811,28.143000000000082,102.64212328767155,33.40012492461446,29.65012492461446,0,0.46854794520547954,0.64554794520547953,0.88404794520547947,0.10619999999999999,0.23849999999999999,0.64554794520547942,0.64554794520547942,7.0800000000000002E-2,0.10619999999999999,0.17699999999999999,0,0.17699999999999999,0.58732876712328763,5.8219178082191785E-2,0,587.32876712328766,58.219178082191782,0,null,0.64554794520547942,0.64554794520547942,0.17699999999999999,null,null,null,null,null,null,null,null,null,null,null,null,null,null,null,null,null,null,null,null,null,null,93.385273972603017,9.2568493150685214,0,null,null,null,null,null,null,null,null,null,null,369.76845486690496,0,432.19000575655434,0,1437.6498862266933,0,432.75496001244528,0,2672.3633068625982,2672.3633068625982,529.19999999999993,3201.563306862598,424.90576579115441,3201.563306862598,null,null,null,null,null,null,null,null,null,null,null,null,null,null,null,null,null,null,null,null,null,null,null,null,null,null,null,null,null,null,null,null,null,null,null,null,null,null,null,null,null,null,null,null,null,null,null,null,null,null,null,null,null,null,null,null,null,null,null,null,null,null,null,null,null,null,null,null,null,null,null,null,null,null,null,null,null,null,null,null,null,null,2.5,350,525,875,306.00000000000102,2.5,70.80000000279199,106.20000000418798,177.00000000697997,0.56785714285714284,21,19.5,19.5,19.5,19.5,22.283018868034276,22.283018868034276,19.5,0,106.19999999999999,0,106.19999999999999,132.30000000000001,3201.563306862598,238.5,7.4494856774742435E-2,238.5,645.54794520547944,645.54794520547944,645.54794520547944,106.19999999999999,258.21917808219177,70.8,70.800000000279198,106.2000000004188,177.00000000069798,21.664800000085506,32.497200000128259,54.162000000213766,468.54794520478146,0,72.981000000000236,197.53767123287736,143.37567123266359,270.51867123287764,177.00000000697992,32.497200000128259,null,32.497200000000106,32.497200000000106,null,null,null,{"$f":"HU64","v":2.5},350,525,875,306.00000000000102,2.5,30.595714285714269,45.893571428571406,76.489285714285671,{"$f":"ID64","v":0.56785714285714284},21,19.5,20.148214285714285,20.448214285714286,19.5,21.650876010781673,21.650876010781673,0,19.5,60.30642857142859,106.19999999999999,0,45.893571428571398,132.30000000000001,3201.563306862598,178.1935714285714,5.5658300133128988E-2,178.19357142857143,645.54794520547944,645.54794520547944,645.54794520547944,45.893571428571406,258.21917808219177,30.595714285714269,30.595714285714269,45.893571428571406,76.489285714285671,9.3622885714285964,14.043432857142898,23.405721428571496,569.05865949119379,0,54.527232857143041,197.53767123287736,174.13194980430589,270.51867123287764,0,14.043432857142898,null,32.497200000000106,14.043432857142896,null,null,null,{"$f":"JW64","v":2.5},350,525,875,306.00000000000102,2.5,30.595714285714269,45.893571428571406,76.489285714285671,{"$f":"KF64","v":0.56785714285714284},21,19.5,20.148214285714285,20.448214285714286,19.5,20.448214285714286,20.448214285714286,0,19.5,60.30642857142859,106.19999999999999,0,45.893571428571398,132.30000000000001,3201.563306862598,178.1935714285714,5.5658300133128988E-2,178.19357142857143,645.54794520547944,645.54794520547944,645.54794520547944,45.893571428571406,258.21917808219177,30.595714285714269,30.595714285714269,45.893571428571406,76.489285714285671,9.3622885714285964,14.043432857142898,23.405721428571496,569.05865949119379,0,54.527232857143041,197.53767123287736,174.13194980430589,270.51867123287764,0,14.043432857142898,null,32.497200000000106,14.043432857142896,null,null,null,{"$f":"LY64","v":2.5},350,525,875,306.00000000000102,2.5,70.8,106.19999999999999,177,{"$f":"MH64","v":0.56785714285714284},21,19.5,19.5,19.5,19.5,19.5,19.5,19.5,0,106.19999999999999,0,106.19999999999999,132.30000000000001,3201.563306862598,238.5,7.4494856774742435E-2,238.5,645.54794520547944,645.54794520547944,645.54794520547944,106.19999999999999,258.21917808219177,70.8,70.8,106.19999999999999,177,21.664800000000074,32.497200000000106,54.162000000000177,468.54794520547944,0,72.981000000000236,197.53767123287736,143.37567123287718,270.51867123287764,0,32.497200000000106,884.04794520547944,32.497200000000106,32.497200000000106]
[97.100456621004568,20.5,20.5,68164.39999999998,480.03098591549241,44.1,142.00000000000011,4.41E-2,71.000000000000057,21,20.5,20.5,20.5,20.5,20.5,20.5,20.871069182389938,8.3780000000000054,91.667808219178156,31.90012492461446,30.65012492461446,0,0.58654794520547948,0.64554794520547942,0.72504794520547944,3.5400000000000001E-2,7.9500000000000001E-2,0.64554794520547942,0.64554794520547942,2.3599999999999999E-2,3.5400000000000001E-2,5.899999999999999E-2,0,5.899999999999999E-2,0.58732876712328763,5.8219178082191785E-2,0,587.32876712328766,58.219178082191782,0,null,0.64554794520547942,0.64554794520547942,5.899999999999999E-2,null,null,null,null,null,null,null,null,null,null,null,null,null,null,null,null,null,null,null,null,null,null,83.400684931506916,8.2671232876712395,0,null,null,null,null,null,null,null,null,null,null,440.18913377114205,0,514.49857810883225,0,1711.4436068163081,0,515.17112526975893,0,3181.3024439660412,3181.3024439660417,529.19999999999993,3710.5024439660415,451.74494704317817,3710.5024439660415,null,null,null,null,null,null,null,null,null,null,null,null,null,null,null,null,null,null,null,null,null,null,null,null,null,null,null,null,null,null,null,null,null,null,null,null,null,null,null,null,null,null,null,null,null,null,null,null,null,null,null,null,null,null,null,null,null,null,null,null,null,null,null,null,null,null,null,null,null,null,null,null,null,null,null,null,null,null,null,null,null,null,2.5,350,525,875,307.00000000000102,2.5,23.600000003263997,35.400000004895993,59.000000008159994,0.56785714285714284,21,20.5,20.5,20.5,20.5,21.427672956103144,21.427672956103144,20.5,0,35.4,0,35.4,44.1,3710.5024439660415,79.5,2.1425669757819888E-2,79.5,645.54794520547944,645.54794520547944,645.54794520547944,35.4,258.21917808219177,23.599999999999998,23.600000000326396,35.400000000489598,59.000000000815987,7.245200000100227,10.867800000150343,18.113000000250569,586.54794520466339,0,24.406500000000083,198.18321917808285,180.07021917783226,222.58971917808293,59.000000008159986,10.867800000150343,null,10.867800000000036,10.867800000000036,null,null,null,{"$f":"HU65","v":2.5},350,525,875,307.00000000000102,2.5,10.198571428571423,15.297857142857135,25.496428571428559,{"$f":"ID65","v":0.56785714285714284},21,20.5,20.716071428571428,20.81607142857143,20.5,21.21695867026056,21.21695867026056,0,20.5,20.102142857142862,35.4,0,15.297857142857136,44.1,3710.5024439660415,59.397857142857134,1.6008036119056858E-2,59.397857142857134,645.54794520547944,645.54794520547944,645.54794520547944,15.297857142857135,258.21917808219177,10.198571428571423,10.198571428571423,15.297857142857135,25.496428571428559,3.1309614285714376,4.6964421428571557,7.8274035714285937,620.05151663405093,0,18.2351421428572,198.18321917808285,190.35581560665426,222.58971917808293,0,4.6964421428571557,null,10.867800000000036,4.6964421428571566,null,null,null,{"$f":"JW65","v":2.5},350,525,875,307.00000000000102,2.5,10.198571428571423,15.297857142857135,25.496428571428559,{"$f":"KF65","v":0.56785714285714284},21,20.5,20.716071428571428,20.81607142857143,20.5,20.81607142857143,20.81607142857143,0,20.5,20.102142857142862,35.4,0,15.297857142857136,44.1,3710.5024439660415,59.397857142857134,1.6008036119056858E-2,59.397857142857134,645.54794520547944,645.54794520547944,645.54794520547944,15.297857142857135,258.21917808219177,10.198571428571423,10.198571428571423,15.297857142857135,25.496428571428559,3.1309614285714376,4.6964421428571557,7.8274035714285937,620.05151663405093,0,18.2351421428572,198.18321917808285,190.35581560665426,222.58971917808293,0,4.6964421428571557,null,10.867800000000036,4.6964421428571566,null,null,null,{"$f":"LY65","v":2.5},350,525,875,307.00000000000102,2.5,23.599999999999998,35.4,58.999999999999993,{"$f":"MH65","v":0.56785714285714284},21,20.5,20.5,20.5,20.5,20.5,20.5,20.5,0,35.4,0,35.4,44.1,3710.5024439660415,79.5,2.1425669757819888E-2,79.5,645.54794520547944,645.54794520547944,645.54794520547944,35.4,258.21917808219177,23.599999999999998,23.599999999999998,35.4,58.999999999999993,7.2452000000000236,10.867800000000036,18.113000000000056,586.54794520547944,0,24.406500000000083,198.18321917808285,180.07021917808279,222.58971917808293,0,10.867800000000036,725.04794520547944,10.867800000000036,10.867800000000036]
[98.1392694063927,21.5,21.5,44863.800000000025,493.00879120878972,0,91.000000000000327,0,0,21.5,21.5,21.5,21.5,21.5,21.5,21.5,21.5,0,58.74486301369884,31.65012492461446,31.65012492461446,0,0.64554794520547942,0.64554794520547942,0.64554794520547942,0,1E-53,0.64554794520547942,0.64554794520547942,0,0,0,0,0,0.58732876712328763,5.8219178082191785E-2,0,587.32876712328766,58.219178082191782,0,null,0.64554794520547942,0.64554794520547942,0,null,null,null,null,null,null,null,null,null,null,null,null,null,null,null,null,null,null,null,null,null,null,53.446917808219368,5.2979452054794711,0,null,null,null,null,null,null,null,null,null,null,452.08980068207507,0,528.40822679044925,0,1757.7130822281113,0,529.09895649867212,0,3267.3100661993076,3267.3100661993071,529.19999999999993,3796.5100661993069,297.32521602413806,3796.5100661993069,null,null,null,null,null,null,null,null,null,null,null,null,null,null,null,null,null,null,null,null,null,null,null,null,null,null,null,null,null,null,null,null,null,null,null,null,null,null,null,null,null,null,null,null,null,null,null,null,null,null,null,null,null,null,null,null,null,null,null,null,null,null,null,null,null,null,null,null,null,null,null,null,null,null,null,null,null,null,null,null,null,null,2.5,350,525,875,308.00000000000102,2.5,3.499999999999992E-9,5.2499999999999883E-9,8.7499999999999807E-9,0.56785714285714284,21.5,21.5,21.5,21.5,21.5,21.500000000137579,21.500000000137579,21.5,0,0,0,0,0,3796.5100661993069,0,2.6339980207166994E-54,1E-50,645.54794520547944,645.54794520547944,645.54794520547944,0,258.21917808219177,0,3.499999999999991E-10,5.249999999999987E-10,8.749999999999977E-10,1.0780000000000008E-10,1.6170000000000012E-10,2.6950000000000021E-10,645.54794520460439,0,3.0800000000000106E-51,198.82876712328832,198.82876712301879,198.82876712328832,8.7500140466545417E-9,1.6170000000000012E-10,null,0,0,null,null,null,{"$f":"HU66","v":2.5},350,525,875,308.00000000000102,2.5,0,0,0,{"$f":"ID66","v":0.56785714285714284},21.5,21.5,21.5,21.5,21.5,21.5,21.5,0,21.5,0,0,0,0,0,3796.5100661993069,0,2.6339980207166994E-54,1E-50,645.54794520547944,645.54794520547944,645.54794520547944,0,258.21917808219177,0,0,0,0,0,0,0,645.54794520547944,0,3.0800000000000106E-51,198.82876712328832,198.82876712328832,198.82876712328832,0,0,null,0,0,null,null,null,{"$f":"JW66","v":2.5},350,525,875,308.00000000000102,2.5,0,0,0,{"$f":"KF66","v":0.56785714285714284},21.5,21.5,21.5,21.5,21.5,21.5,21.5,0,21.5,0,0,0,0,0,3796.5100661993069,0,2.6339980207166994E-54,1E-50,645.54794520547944,645.54794520547944,645.54794520547944,0,258.21917808219177,0,0,0,0,0,0,0,645.54794520547944,0,3.0800000000000106E-51,198.82876712328832,198.82876712328832,198.82876712328832,0,0,null,0,0,null,null,null,{"$f":"LY66","v":2.5},350,525,875,308.00000000000102,2.5,0,0,0,{"$f":"MH66","v":0.56785714285714284},21.5,21.5,21.5,21.5,21.5,21.5,21.5,21.5,0,0,0,0,0,3796.5100661993069,0,2.6339980207166994E-54,1E-50,645.54794520547944,645.54794520547944,645.54794520547944,0,258.21917808219177,0,0,0,0,0,0,0,645.54794520547944,0,3.0800000000000106E-51,198.82876712328832,198.82876712328832,198.82876712328832,0,0,645.54794520547944,0,0]
[98.698630136986296,22.5,22.5,22371.999999999989,456.57142857143748,0,48.999999999999019,0,0,22.5,22.5,22.5,22.5,22.5,22.5,22.5,22.5,0,31.631849315067857,32.65012492461446,32.65012492461446,0,0.64554794520547942,0.64554794520547942,0.64554794520547942,0,1E-53,0.64554794520547942,0.64554794520547942,0,0,0,0,0,0.58732876712328763,5.8219178082191785E-2,0,587.32876712328766,58.219178082191782,0,null,0.64554794520547942,0.64554794520547942,0,null,null,null,null,null,null,null,null,null,null,null,null,null,null,null,null,null,null,null,null,null,null,28.77910958904052,2.8527397260273402,0,null,null,null,null,null,null,null,null,null,null,418.67668451489357,0,489.35455772114898,0,1627.8037781109763,0,489.99423688156884,0,3025.8292572285877,3025.8292572285877,529.19999999999993,3555.0292572285875,148.26563360419783,3555.0292572285875,null,null,null,null,null,null,null,null,null,null,null,null,null,null,null,null,null,null,null,null,null,null,null,null,null,null,null,null,null,null,null,null,null,null,null,null,null,null,null,null,null,null,null,null,null,null,null,null,null,null,null,null,null,null,null,null,null,null,null,null,null,null,null,null,null,null,null,null,null,null,null,null,null,null,null,null,null,null,null,null,null,null,2.5,350,525,875,309.00000000000102,2.5,3.499999999999992E-9,5.2499999999999883E-9,8.7499999999999807E-9,0.56785714285714284,22.5,22.5,22.5,22.5,22.5,22.500000000137579,22.500000000137579,22.5,0,0,0,0,0,3555.0292572285875,0,2.8129163718319865E-54,1E-50,645.54794520547944,645.54794520547944,645.54794520547944,0,258.21917808219177,0,3.499999999999991E-10,5.249999999999987E-10,8.749999999999977E-10,1.0815000000000009E-10,1.6222500000000013E-10,2.7037500000000016E-10,645.54794520460439,0,3.0900000000000105E-51,199.47431506849381,199.4743150682234,199.47431506849381,8.7500140466545417E-9,1.6222500000000013E-10,null,0,0,null,null,null,{"$f":"HU67","v":2.5},350,525,875,309.00000000000102,2.5,0,0,0,{"$f":"ID67","v":0.56785714285714284},22.5,22.5,22.5,22.5,22.5,22.5,22.5,0,22.5,0,0,0,0,0,3555.0292572285875,0,2.8129163718319865E-54,1E-50,645.54794520547944,645.54794520547944,645.54794520547944,0,258.21917808219177,0,0,0,0,0,0,0,645.54794520547944,0,3.0900000000000105E-51,199.47431506849381,199.47431506849381,199.47431506849381,0,0,null,0,0,null,null,null,{"$f":"JW67","v":2.5},350,525,875,309.00000000000102,2.5,0,0,0,{"$f":"KF67","v":0.56785714285714284},22.5,22.5,22.5,22.5,22.5,22.5,22.5,0,22.5,0,0,0,0,0,3555.0292572285875,0,2.8129163718319865E-54,1E-50,645.54794520547944,645.54794520547944,645.54794520547944,0,258.21917808219177,0,0,0,0,0,0,0,645.54794520547944,0,3.0900000000000105E-51,199.47431506849381,199.47431506849381,199.47431506849381,0,0,null,0,0,null,null,null,{"$f":"LY67","v":2.5},350,525,875,309.00000000000102,2.5,0,0,0,{"$f":"MH67","v":0.56785714285714284},22.5,22.5,22.5,22.5,22.5,22.5,22.5,22.5,0,0,0,0,0,3555.0292572285875,0,2.8129163718319865E-54,1E-50,645.54794520547944,645.54794520547944,645.54794520547944,0,258.21917808219177,0,0,0,0,0,0,0,645.54794520547944,0,3.0900000000000105E-51,199.47431506849381,199.47431506849381,199.47431506849381,0,0,645.54794520547944,0,0]
[99.166666666666671,23.5,23.5,18615.2,454.0292682926729,0,41.000000000000909,0,0,23.5,23.5,23.5,23.5,23.5,23.5,23.5,23.5,0,26.467465753425245,33.65012492461446,33.65012492461446,0,0.64554794520547942,0.64554794520547942,0.64554794520547942,0,1E-53,0.64554794520547942,0.64554794520547942,0,0,0,0,0,0.58732876712328763,5.8219178082191785E-2,0,587.32876712328766,58.219178082191782,0,null,0.64554794520547942,0.64554794520547942,0,null,null,null,null,null,null,null,null,null,null,null,null,null,null,null,null,null,null,null,null,null,null,24.080479452055329,2.386986301369916,0,null,null,null,null,null,null,null,null,null,null,416.34551972793167,0,486.62986309283303,0,1618.7402716202519,0,487.26598056092826,0,3008.9816350019446,3008.9816350019446,529.19999999999993,3538.1816350019444,123.36824703508246,3538.1816350019444,null,null,null,null,null,null,null,null,null,null,null,null,null,null,null,null,null,null,null,null,null,null,null,null,null,null,null,null,null,null,null,null,null,null,null,null,null,null,null,null,null,null,null,null,null,null,null,null,null,null,null,null,null,null,null,null,null,null,null,null,null,null,null,null,null,null,null,null,null,null,null,null,null,null,null,null,null,null,null,null,null,null,2.5,350,525,875,310.00000000000102,2.5,3.499999999999992E-9,5.2499999999999883E-9,8.7499999999999807E-9,0.56785714285714284,23.5,23.5,23.5,23.5,23.5,23.500000000137579,23.500000000137579,23.5,0,0,0,0,0,3538.1816350019444,0,2.8263105265918617E-54,1E-50,645.54794520547944,645.54794520547944,645.54794520547944,0,258.21917808219177,0,3.499999999999991E-10,5.249999999999987E-10,8.749999999999977E-10,1.0850000000000008E-10,1.6275000000000014E-10,2.7125000000000017E-10,645.54794520460439,0,3.1000000000000104E-51,200.11986301369927,200.11986301342802,200.11986301369927,8.7500140466545417E-9,1.6275000000000014E-10,null,0,0,null,null,null,{"$f":"HU68","v":2.5},350,525,875,310.00000000000102,2.5,0,0,0,{"$f":"ID68","v":0.56785714285714284},23.5,23.5,23.5,23.5,23.5,23.5,23.5,0,23.5,0,0,0,0,0,3538.1816350019444,0,2.8263105265918617E-54,1E-50,645.54794520547944,645.54794520547944,645.54794520547944,0,258.21917808219177,0,0,0,0,0,0,0,645.54794520547944,0,3.1000000000000104E-51,200.11986301369927,200.11986301369927,200.11986301369927,0,0,null,0,0,null,null,null,{"$f":"JW68","v":2.5},350,525,875,310.00000000000102,2.5,0,0,0,{"$f":"KF68","v":0.56785714285714284},23.5,23.5,23.5,23.5,23.5,23.5,23.5,0,23.5,0,0,0,0,0,3538.1816350019444,0,2.8263105265918617E-54,1E-50,645.54794520547944,645.54794520547944,645.54794520547944,0,258.21917808219177,0,0,0,0,0,0,0,645.54794520547944,0,3.1000000000000104E-51,200.11986301369927,200.11986301369927,200.11986301369927,0,0,null,0,0,null,null,null,{"$f":"LY68","v":2.5},350,525,875,310.00000000000102,2.5,0,0,0,{"$f":"MH68","v":0.56785714285714284},23.5,23.5,23.5,23.5,23.5,23.5,23.5,23.5,0,0,0,0,0,3538.1816350019444,0,2.8263105265918617E-54,1E-50,645.54794520547944,645.54794520547944,645.54794520547944,0,258.21917808219177,0,0,0,0,0,0,0,645.54794520547944,0,3.1000000000000104E-51,200.11986301369927,200.11986301369927,200.11986301369927,0,0,645.54794520547944,0,0]
[99.497716894977174,24.5,24.5,15177.800000000001,523.37241379310331,0,29.000000000000007,0,0,24.5,24.5,24.5,24.5,24.5,24.5,24.5,24.5,0,18.720890410958908,34.65012492461446,34.65012492461446,0,0.64554794520547942,0.64554794520547942,0.64554794520547942,0,1E-53,0.64554794520547942,0.64554794520547942,0,0,0,0,0,0.58732876712328763,5.8219178082191785E-2,0,587.32876712328766,58.219178082191782,0,null,0.64554794520547942,0.64554794520547942,0,null,null,null,null,null,null,null,null,null,null,null,null,null,null,null,null,null,null,null,null,null,null,17.032534246575345,1.6883561643835621,0,null,null,null,null,null,null,null,null,null,null,479.9332881145632,0,560.95204396939437,0,1865.9678184356094,0,561.68531461510611,0,3468.5384651346731,3468.5384651346735,529.19999999999993,3997.7384651346733,100.58761548890554,3997.7384651346733,null,null,null,null,null,null,null,null,null,null,null,null,null,null,null,null,null,null,null,null,null,null,null,null,null,null,null,null,null,null,null,null,null,null,null,null,null,null,null,null,null,null,null,null,null,null,null,null,null,null,null,null,null,null,null,null,null,null,null,null,null,null,null,null,null,null,null,null,null,null,null,null,null,null,null,null,null,null,null,null,null,null,2.5,350,525,875,311.00000000000102,2.5,3.499999999999992E-9,5.2499999999999883E-9,8.7499999999999807E-9,0.56785714285714284,24.5,24.5,24.5,24.5,24.5,24.500000000137579,24.500000000137579,24.5,0,0,0,0,0,3997.7384651346733,0,2.5014142588897761E-54,1E-50,645.54794520547944,645.54794520547944,645.54794520547944,0,258.21917808219177,0,3.499999999999991E-10,5.249999999999987E-10,8.749999999999977E-10,1.0885000000000008E-10,1.6327500000000012E-10,2.7212500000000018E-10,645.54794520460439,0,3.1100000000000103E-51,200.76541095890477,200.7654109586326,200.76541095890477,8.7500140466545417E-9,1.6327500000000012E-10,null,0,0,null,null,null,{"$f":"HU69","v":2.5},350,525,875,311.00000000000102,2.5,0,0,0,{"$f":"ID69","v":0.56785714285714284},24.5,24.5,24.5,24.5,24.5,24.5,24.5,0,24.5,0,0,0,0,0,3997.7384651346733,0,2.5014142588897761E-54,1E-50,645.54794520547944,645.54794520547944,645.54794520547944,0,258.21917808219177,0,0,0,0,0,0,0,645.54794520547944,0,3.1100000000000103E-51,200.76541095890477,200.76541095890477,200.76541095890477,0,0,null,0,0,null,null,null,{"$f":"JW69","v":2.5},350,525,875,311.00000000000102,2.5,0,0,0,{"$f":"KF69","v":0.56785714285714284},24.5,24.5,24.5,24.5,24.5,24.5,24.5,0,24.5,0,0,0,0,0,3997.7384651346733,0,2.5014142588897761E-54,1E-50,645.54794520547944,645.54794520547944,645.54794520547944,0,258.21917808219177,0,0,0,0,0,0,0,645.54794520547944,0,3.1100000000000103E-51,200.76541095890477,200.76541095890477,200.76541095890477,0,0,null,0,0,null,null,null,{"$f":"LY69","v":2.5},350,525,875,311.00000000000102,2.5,0,0,0,{"$f":"MH69","v":0.56785714285714284},24.5,24.5,24.5,24.5,24.5,24.5,24.5,24.5,0,0,0,0,0,3997.7384651346733,0,2.5014142588897761E-54,1E-50,645.54794520547944,645.54794520547944,645.54794520547944,0,258.21917808219177,0,0,0,0,0,0,0,645.54794520547944,0,3.1100000000000103E-51,200.76541095890477,200.76541095890477,200.76541095890477,0,0,645.54794520547944,0,0]
[99.851598173515981,25.5,25.5,17592.099999999999,567.48709677420197,0,30.999999999999535,0,0,25.5,25.5,25.5,25.5,25.5,25.5,25.5,25.5,0,20.011986301369561,35.65012492461446,35.65012492461446,0,0.64554794520547942,0.64554794520547942,0.64554794520547942,0,9.9999999999999991E-54,0.64554794520547942,0.64554794520547942,0,0,0,0,0,0.58732876712328763,5.8219178082191785E-2,0,587.32876712328766,58.219178082191782,0,null,0.64554794520547942,0.64554794520547942,0,null,null,null,null,null,null,null,null,null,null,null,null,null,null,null,null,null,null,null,null,null,null,18.207191780821642,1.8047945205479183,0,null,null,null,null,null,null,null,null,null,null,520.38651854718557,0,608.23428685255044,0,2023.2488989699002,0,609.0293643517042,0,3760.8990687213409,3760.8990687213409,529.19999999999993,4290.0990687213407,116.58787113035982,4290.0990687213407,null,null,null,null,null,null,null,null,null,null,null,null,null,null,null,null,null,null,null,null,null,null,null,null,null,null,null,null,null,null,null,null,null,null,null,null,null,null,null,null,null,null,null,null,null,null,null,null,null,null,null,null,null,null,null,null,null,null,null,null,null,null,null,null,null,null,null,null,null,null,null,null,null,null,null,null,null,null,null,null,null,null,2.5,350,525,875,312.00000000000102,2.5,3.499999999999992E-9,5.2499999999999883E-9,8.7499999999999807E-9,0.56785714285714284,25.5,25.5,25.5,25.5,25.5,25.500000000137579,25.500000000137579,25.5,0,0,0,0,0,4290.0990687213407,0,2.3309485025436692E-54,9.9999999999999989E-51,645.54794520547944,645.54794520547944,645.54794520547944,0,258.21917808219177,0,3.499999999999991E-10,5.249999999999987E-10,8.749999999999977E-10,1.0920000000000009E-10,1.6380000000000012E-10,2.7300000000000019E-10,645.54794520460439,0,3.1200000000000102E-51,201.41095890411023,201.41095890383721,201.41095890411023,8.7500140466545417E-9,1.6380000000000012E-10,null,0,0,null,null,null,{"$f":"HU70","v":2.5},350,525,875,312.00000000000102,2.5,0,0,0,{"$f":"ID70","v":0.56785714285714284},25.5,25.5,25.5,25.5,25.5,25.5,25.5,0,25.5,0,0,0,0,0,4290.0990687213407,0,2.3309485025436692E-54,9.9999999999999989E-51,645.54794520547944,645.54794520547944,645.54794520547944,0,258.21917808219177,0,0,0,0,0,0,0,645.54794520547944,0,3.1200000000000102E-51,201.41095890411023,201.41095890411023,201.41095890411023,0,0,null,0,0,null,null,null,{"$f":"JW70","v":2.5},350,525,875,312.00000000000102,2.5,0,0,0,{"$f":"KF70","v":0.56785714285714284},25.5,25.5,25.5,25.5,25.5,25.5,25.5,0,25.5,0,0,0,0,0,4290.0990687213407,0,2.3309485025436692E-54,9.9999999999999989E-51,645.54794520547944,645.54794520547944,645.54794520547944,0,258.21917808219177,0,0,0,0,0,0,0,645.54794520547944,0,3.1200000000000102E-51,201.41095890411023,201.41095890411023,201.41095890411023,0,0,null,0,0,null,null,null,{"$f":"LY70","v":2.5},350,525,875,312.00000000000102,2.5,0,0,0,{"$f":"MH70","v":0.56785714285714284},25.5,25.5,25.5,25.5,25.5,25.5,25.5,25.5,0,0,0,0,0,4290.0990687213407,0,2.3309485025436692E-54,9.9999999999999989E-51,645.54794520547944,645.54794520547944,645.54794520547944,0,258.21917808219177,0,0,0,0,0,0,0,645.54794520547944,0,3.1200000000000102E-51,201.41095890411023,201.41095890411023,201.41095890411023,0,0,645.54794520547944,0,0]
[99.908675799086751,26.5,26.5,2258,451.60000000005027,0,4.9999999999994431,0,0,26.5,26.5,26.5,26.5,26.5,26.5,26.5,26.5,0,3.2277397260270377,36.65012492461446,36.65012492461446,0,0.64554794520547942,0.64554794520547942,0.64554794520547942,0,1.0000000000000001E-53,0.64554794520547942,0.64554794520547942,0,0,0,0,0,0.58732876712328763,5.8219178082191785E-2,0,587.32876712328766,58.219178082191782,0,null,0.64554794520547942,0.64554794520547942,0,null,null,null,null,null,null,null,null,null,null,null,null,null,null,null,null,null,null,null,null,null,null,2.9366438356161111,0.29109589041092648,0,null,null,null,null,null,null,null,null,null,null,414.11787706151534,0,484.0261664168454,0,1610.0792563719936,0,484.65888035987405,0,2992.8821802102284,2992.8821802102284,529.19999999999993,3522.0821802102282,14.964410901049476,3522.0821802102282,null,null,null,null,null,null,null,null,null,null,null,null,null,null,null,null,null,null,null,null,null,null,null,null,null,null,null,null,null,null,null,null,null,null,null,null,null,null,null,null,null,null,null,null,null,null,null,null,null,null,null,null,null,null,null,null,null,null,null,null,null,null,null,null,null,null,null,null,null,null,null,null,null,null,null,null,null,null,null,null,null,null,2.5,350,525,875,313.00000000000102,2.5,3.499999999999992E-9,5.2499999999999883E-9,8.7499999999999807E-9,0.56785714285714284,26.5,26.5,26.5,26.5,26.5,26.500000000137579,26.500000000137579,26.5,0,0,0,0,0,3522.0821802102282,0,2.8392296057677776E-54,1.0000000000000001E-50,645.54794520547944,645.54794520547944,645.54794520547944,0,258.21917808219177,0,3.499999999999991E-10,5.249999999999987E-10,8.749999999999977E-10,1.0955000000000008E-10,1.6432500000000013E-10,2.7387500000000015E-10,645.54794520460439,0,3.1300000000000107E-51,202.05650684931572,202.05650684904182,202.05650684931572,8.7500140466545417E-9,1.6432500000000013E-10,null,0,0,null,null,null,{"$f":"HU71","v":2.5},350,525,875,313.00000000000102,2.5,0,0,0,{"$f":"ID71","v":0.56785714285714284},26.5,26.5,26.5,26.5,26.5,26.5,26.5,0,26.5,0,0,0,0,0,3522.0821802102282,0,2.8392296057677776E-54,1.0000000000000001E-50,645.54794520547944,645.54794520547944,645.54794520547944,0,258.21917808219177,0,0,0,0,0,0,0,645.54794520547944,0,3.1300000000000107E-51,202.05650684931572,202.05650684931572,202.05650684931572,0,0,null,0,0,null,null,null,{"$f":"JW71","v":2.5},350,525,875,313.00000000000102,2.5,0,0,0,{"$f":"KF71","v":0.56785714285714284},26.5,26.5,26.5,26.5,26.5,26.5,26.5,0,26.5,0,0,0,0,0,3522.0821802102282,0,2.8392296057677776E-54,1.0000000000000001E-50,645.54794520547944,645.54794520547944,645.54794520547944,0,258.21917808219177,0,0,0,0,0,0,0,645.54794520547944,0,3.1300000000000107E-51,202.05650684931572,202.05650684931572,202.05650684931572,0,0,null,0,0,null,null,null,{"$f":"LY71","v":2.5},350,525,875,313.00000000000102,2.5,0,0,0,{"$f":"MH71","v":0.56785714285714284},26.5,26.5,26.5,26.5,26.5,26.5,26.5,26.5,0,0,0,0,0,3522.0821802102282,0,2.8392296057677776E-54,1.0000000000000001E-50,645.54794520547944,645.54794520547944,645.54794520547944,0,258.21917808219177,0,0,0,0,0,0,0,645.54794520547944,0,3.1300000000000107E-51,202.05650684931572,202.05650684931572,202.05650684931572,0,0,645.54794520547944,0,0]
[99.942922374429216,27.5,27.5,1634.5,544.83333333334883,0,2.9999999999999147,0,0,27.5,27.5,27.5,27.5,27.5,27.5,27.5,27.5,0,1.9366438356163833,37.65012492461446,37.65012492461446,0,0.64554794520547942,0.64554794520547942,0.64554794520547942,0,1E-53,0.64554794520547942,0.64554794520547942,0,0,0,0,0,0.58732876712328763,5.8219178082191785E-2,0,587.32876712328766,58.219178082191782,0,null,0.64554794520547942,0.64554794520547942,0,null,null,null,null,null,null,null,null,null,null,null,null,null,null,null,null,null,null,null,null,null,null,1.7619863013698127,0.17465753424657038,0,null,null,null,null,null,null,null,null,null,null,499.61298350825996,0,583.95391866568377,0,1942.4819490255422,0,584.71725712145599,0,3610.7661083209418,3610.7661083209418,529.19999999999993,4139.9661083209421,10.832298324962517,4139.9661083209421,null,null,null,null,null,null,null,null,null,null,null,null,null,null,null,null,null,null,null,null,null,null,null,null,null,null,null,null,null,null,null,null,null,null,null,null,null,null,null,null,null,null,null,null,null,null,null,null,null,null,null,null,null,null,null,null,null,null,null,null,null,null,null,null,null,null,null,null,null,null,null,null,null,null,null,null,null,null,null,null,null,null,2.5,350,525,875,314.00000000000102,2.5,3.499999999999992E-9,5.2499999999999883E-9,8.7499999999999807E-9,0.56785714285714284,27.5,27.5,27.5,27.5,27.5,27.500000000137579,27.500000000137579,27.5,0,0,0,0,0,4139.9661083209421,0,2.4154787112631047E-54,1E-50,645.54794520547944,645.54794520547944,645.54794520547944,0,258.21917808219177,0,3.499999999999991E-10,5.249999999999987E-10,8.749999999999977E-10,1.0990000000000008E-10,1.6485000000000011E-10,2.7475000000000016E-10,645.54794520460439,0,3.1400000000000101E-51,202.70205479452119,202.70205479424644,202.70205479452119,8.7500140466545417E-9,1.6485000000000011E-10,null,0,0,null,null,null,{"$f":"HU72","v":2.5},350,525,875,314.00000000000102,2.5,0,0,0,{"$f":"ID72","v":0.56785714285714284},27.5,27.5,27.5,27.5,27.5,27.5,27.5,0,27.5,0,0,0,0,0,4139.9661083209421,0,2.4154787112631047E-54,1E-50,645.54794520547944,645.54794520547944,645.54794520547944,0,258.21917808219177,0,0,0,0,0,0,0,645.54794520547944,0,3.1400000000000101E-51,202.70205479452119,202.70205479452119,202.70205479452119,0,0,null,0,0,null,null,null,{"$f":"JW72","v":2.5},350,525,875,314.00000000000102,2.5,0,0,0,{"$f":"KF72","v":0.56785714285714284},27.5,27.5,27.5,27.5,27.5,27.5,27.5,0,27.5,0,0,0,0,0,4139.9661083209421,0,2.4154787112631047E-54,1E-50,645.54794520547944,645.54794520547944,645.54794520547944,0,258.21917808219177,0,0,0,0,0,0,0,645.54794520547944,0,3.1400000000000101E-51,202.70205479452119,202.70205479452119,202.70205479452119,0,0,null,0,0,null,null,null,{"$f":"LY72","v":2.5},350,525,875,314.00000000000102,2.5,0,0,0,{"$f":"MH72","v":0.56785714285714284},27.5,27.5,27.5,27.5,27.5,27.5,27.5,27.5,0,0,0,0,0,4139.9661083209421,0,2.4154787112631047E-54,1E-50,645.54794520547944,645.54794520547944,645.54794520547944,0,258.21917808219177,0,0,0,0,0,0,0,645.54794520547944,0,3.1400000000000101E-51,202.70205479452119,202.70205479452119,202.70205479452119,0,0,645.54794520547944,0,0]
[100,28.5,28.5,3244.8999999999996,648.97999999991066,0,5.0000000000006875,0,0,28.5,28.5,28.5,28.5,28.5,28.5,28.5,28.5,0,3.2277397260278411,38.65012492461446,38.65012492461446,0,0.64554794520547942,0.64554794520547942,0.64554794520547942,0,9.9999999999999991E-54,0.64554794520547942,0.64554794520547942,0,0,0,0,0,0.58732876712328763,5.8219178082191785E-2,0,587.32876712328766,58.219178082191782,0,null,0.64554794520547942,0.64554794520547942,0,null,null,null,null,null,null,null,null,null,null,null,null,null,null,null,null,null,null,null,null,null,null,2.9366438356168421,0.29109589041099893,0,null,null,null,null,null,null,null,null,null,null,595.11563298342617,0,695.57861266856992,0,2313.7937019487067,0,696.48786575702559,0,4300.9758133577279,4300.9758133577279,529.19999999999993,4830.1758133577277,21.504879066791595,4830.1758133577277,null,null,null,null,null,null,null,null,null,null,null,null,null,null,null,null,null,null,null,null,null,null,null,null,null,null,null,null,null,null,null,null,null,null,null,null,null,null,null,null,null,null,null,null,null,null,null,null,null,null,null,null,null,null,null,null,null,null,null,null,null,null,null,null,null,null,null,null,null,null,null,null,null,null,null,null,null,null,null,null,null,null,2.5,350,525,875,315.00000000000102,2.5,3.499999999999992E-9,5.2499999999999883E-9,8.7499999999999807E-9,0.56785714285714284,28.5,28.5,28.5,28.5,28.5,28.500000000137579,28.500000000137579,28.5,0,0,0,0,0,4830.1758133577277,0,2.0703180145834971E-54,9.9999999999999989E-51,645.54794520547944,645.54794520547944,645.54794520547944,0,258.21917808219177,0,3.499999999999991E-10,5.249999999999987E-10,8.749999999999977E-10,1.1025000000000008E-10,1.6537500000000011E-10,2.7562500000000017E-10,645.54794520460439,0,3.15000000000001E-51,203.34760273972668,203.34760273945102,203.34760273972668,8.7500140466545417E-9,1.6537500000000011E-10,null,0,0,null,null,null,{"$f":"HU73","v":2.5},350,525,875,315.00000000000102,2.5,0,0,0,{"$f":"ID73","v":0.56785714285714284},28.5,28.5,28.5,28.5,28.5,28.5,28.5,0,28.5,0,0,0,0,0,4830.1758133577277,0,2.0703180145834971E-54,9.9999999999999989E-51,645.54794520547944,645.54794520547944,645.54794520547944,0,258.21917808219177,0,0,0,0,0,0,0,645.54794520547944,0,3.15000000000001E-51,203.34760273972668,203.34760273972668,203.34760273972668,0,0,null,0,0,null,null,null,{"$f":"JW73","v":2.5},350,525,875,315.00000000000102,2.5,0,0,0,{"$f":"KF73","v":0.56785714285714284},28.5,28.5,28.5,28.5,28.5,28.5,28.5,0,28.5,0,0,0,0,0,4830.1758133577277,0,2.0703180145834971E-54,9.9999999999999989E-51,645.54794520547944,645.54794520547944,645.54794520547944,0,258.21917808219177,0,0,0,0,0,0,0,645.54794520547944,0,3.15000000000001E-51,203.34760273972668,203.34760273972668,203.34760273972668,0,0,null,0,0,null,null,null,{"$f":"LY73","v":2.5},350,525,875,315.00000000000102,2.5,0,0,0,{"$f":"MH73","v":0.56785714285714284},28.5,28.5,28.5,28.5,28.5,28.5,28.5,28.5,0,0,0,0,0,4830.1758133577277,0,2.0703180145834971E-54,9.9999999999999989E-51,645.54794520547944,645.54794520547944,645.54794520547944,0,258.21917808219177,0,0,0,0,0,0,0,645.54794520547944,0,3.15000000000001E-51,203.34760273972668,203.34760273972668,203.34760273972668,0,0,645.54794520547944,0,0]
[null,null,null,0]
[null,"Lämmitysraja, ulkolämpötila on 12 °C"]
[72.203196347031962,-50,0]
[72.203196347031962,{"$f":"MAX(INT((MAX(J24:Q74,T24:U74)+10)/10)*10,50)","v":100},{"$f":"INT(MAX(X24:AF74)+1)","v":8}]
[{"$f":"\"A\"&$FT$7","v":"A57"}]
[{"$f":"8760*A81/100","v":6325},"h"]
[{"$f":"MAX(A24:INDIRECT(A79))","v":72.203196347031962}]
[null,null,null,null,null,"IV käyntiaikakerroin",{"$f":"$CB$10/24*$CC$10/7","v":1}]
[]
[null,null,null,{"$f":"F84&G84&\" kWh\"","v":"A: 8806 kWh"},null,"A: ",{"$f":"INT('Hki-2012'!$HP$8*$G$82+0.5)","v":8806}]
[null,null,null,{"$f":"F85&G85&\" %\"","v":"LTO:n vuosihyötysuhde: 72 %"},null,"LTO:n vuosihyötysuhde: ",{"$f":"INT('Hki-2012'!$HB$10*$G$82*100+0.5)","v":72}]
[]
[null,null,null,{"$f":"F87&G87&\" kWh\"","v":"LTO: 3053 kWh"},null,"LTO: ",{"$f":"INT('Hki-2012'!$HR$8*$G$82+0.5)","v":3053}]
[null,null,null,{"$f":"F88&G88&\" kWh\"","v":"PILP: 3296 kWh"},null,"PILP: ",{"$f":"INT('Hki-2012'!$HE$8*$G$82+0.5)","v":3296},null,"Höyrystin"]
[null,null,null,{"$f":"F89&G89&\" kWh\"","v":"B: 2456 kWh"},null,"B: ",{"$f":"INT('Hki-2012'!$HO$8*$G$82+0.5)","v":2456}]
[null,null,null,{"$f":"F90&G90&\" kWh\"","v":"PILP:n lauhdutin: 5493 kWh"},null,"PILP:n lauhdutin: ",{"$f":"INT('Hki-2012'!$HF$8*$G$82+0.5)","v":5493},null,"Lauhdutin"]
[null,null,null,{"$f":"F91&G91&\" kWh\"","v":"Hyödynnetyt lämpökuormat: 5473 kWh"},null,"Hyödynnetyt lämpökuormat: ",{"$f":"INT('Hki-2012'!$HI$8*$G$82+0.5)","v":5473}]
[null,null,null,{"$f":"F92&G92&\" kWh\"","v":"Muu lämmitys: 9838 kWh"},null,"Muu lämmitys: ",{"$f":"INT('Hki-2012'!$HK$8*$G$82+0.5)","v":9838}]
[null,null,null,"PILPtilat: 0 kWh",null,"PILPtilat: ",{"$f":"INT('Hki-2012'!$K$100*$G$82+0.5)","v":0}]
[null,null,null,"PILP yhteensä: 0 kWh",null,"PILP yhteensä: ",{"$f":"INT('Hki-2012'!$K$102*$G$82+0.5)","v":0}]
[null,null,null,"PILPilmanvaihto: 0 kWh",null,"PILPilmanvaihto: ",{"$f":"INT('Hki-2012'!$K$99*$G$82+0.5)","v":0}]
[null,null,null,"Kompressorin sähkö: 2197 kWh",null,"Kompressorin sähkö: ",{"$f":"INT('Hki-2012'!$HD$8*$G$82+0.5)","v":2197},null,"Kompura"]
[null,null,null,{"$f":"F97&G97&\" kWh\"","v":"Muu lämpöhäviö: 0 kWh"},null,"Muu lämpöhäviö: ",{"$f":"INT('Hki-2012'!$BQ$8*$G$82+0.5)","v":0}]
[null,null,null,"Tuloilman jälkilämmitys: 2443 kWh",null,"Tuloilman jälkilämmitys: ",{"$f":"INT('Hki-2012'!$HH$8*$G$82+0.5)","v":2443}]
[null,null,null,"UILP: 0 kWh",null,"UILP: ",{"$f":"INT('Hki-2012'!$K$106*$G$82+0.5)","v":0}]
[null,null,null,"Käyttöveden lämmitys: 3715 kWh",null,"Käyttöveden lämmitys: ",{"$f":"INT('Hki-2012'!$BO$8*$G$82+0.5)","v":3715}]
[null,null,null,"Käyttöveden lämpöhäviö: 368 kWh",null,"Käyttöveden lämpöhäviö: ",{"$f":"INT('Hki-2012'!$BP$8*$G$82+0.5)","v":368}]
[null,null,null,"Tuloilman lämmitys: 2443 kWh",null,"Tuloilman lämmitys: ",{"$f":"INT('Hki-2012'!$HH$8*$G$82+0.5)","v":2443}]
[null,null,null,"Tilojen lämmitys: 0 kWh",null,"Tilojen lämmitys: ",{"$f":"INT('Hki-2012'!$FN$21*$G$82+0.5)","v":0}]
[null,null,null,"Bruttolämmöntarve: 23858 kWh",null,"Bruttolämmöntarve: ",{"$f":"INT('Hki-2012'!$HL$8*$G$82+0.5)","v":23858}]