{"text_format":"3","workbook":"xlsx","n_sheets":6,"sheets":["Kohdetiedot","Energia","Toimenpiteet","Tarkastuslista","Ohjeita","Luokitukset"],"not_rendered":{"external_links":1,"defined_names":9,"comments":3},"read":"whole","date_system":"1900"}

{"sheet":"Kohdetiedot","index":0,"n_rows":72,"n_cols":13,"rows_kept":72,"merged":[[2,1,2,2],[4,10,10,18],[8,1,8,8],[10,2,10,8],[12,2,12,8],[14,4,14,8],[37,2,37,8],[41,2,41,9],[42,2,42,8],[43,2,43,9],[44,2,44,9],[46,2,46,9],[48,2,48,9],[50,2,50,9],[51,2,51,9],[54,2,54,9],[56,2,56,9],[57,2,57,9],[58,2,58,9],[59,2,59,4],[60,2,60,4],[61,2,61,4],[62,2,62,4],[63,2,63,4],[64,2,64,8],[65,2,65,9],[67,2,67,6],[68,2,68,6],[69,2,69,6],[70,2,70,6],[71,2,71,6],[72,2,72,9],[73,2,73,9]]}
["Päätaulu Täsmäkatselmus",null,"Kohdetiedot",{"$nulls":9},"tama sarake piilotettaan lopullisesta"]
[null,"2021-08-13"]
[null,"Hankkeen diaari numero",{"$nulls":3},"/",31,"/",null,null,"Vihreällä merkityt solut ovat pakollisia"]
[null,null,"esim.",null,1234,"/",31,"/",2021]
[]
[null,"Raportin päiväys",null,null,"esim. 16.8.2021"]
[]
[]
[null,"Kohteen tiedot"]
[]
[null,"Kohteen nimi"]
[]
[null,"Osoite"]
[]
[null,"Postinro ja toimipaikka"]
[]
[null,"Rakennustyyppi","*Tähän valitaan rakennustyyppi listasta vastaavati kuin katselmusten seurantalomakkeella B1 ESS puolella tällä hetkellä"]
[]
[null,"Toimiala","*Tähän valitaan toimiala listasta vastaavati kuin katselmusten seurantalomakkeella B1 ESS puolella tällä hetkellä"]
[]
[null,"Rakennustilavuus"]
[]
[null,"Lämmitetty tilavuus",null,"m3"]
[]
[null,"Kylmätilavuus",null,"m3"]
[]
[null,"Rakennuksen bruttoala"]
[]
[null,"lämmin",null,"m2"]
[]
{"$rows_left_out":43}
{"sheet":"Energia","index":1,"n_rows":54,"n_cols":14,"rows_kept":54,"merged":[[27,1,27,5],[27,7,27,11],[55,1,55,7]]}
[{"$f":"Kohdetiedot!A1","v":"Päätaulu Täsmäkatselmus"},null,null,"Taulukko 1",null,"diaari",null,{"$f":"CONCATENATE(Kohdetiedot!E3,\"/\",Kohdetiedot!G3,\"/\",Kohdetiedot!I3)","v":"/31/"}]
[]
[]
[{"$nulls":13},"Täytä vihreällä merkityt solut"]
[null,"Nykyinen kulutus",null,"Säästöpotentiaali",{"$nulls":5},"Kokonaisinvestointi",{"$nulls":3},"Sinisellä merkittyjen solujen arvo lasketaan"]
[]
[null,{"$f":"IF(ISBLANK(Kohdetiedot!C6),\"\",(YEAR(Kohdetiedot!C6)-1))","v":""}]
[null,"Lämpö + polttoaineet"]
[null,{"$f":"D32+D36+D38+D40+D44+D46","v":{"v":0,"d":" 0"}},"MWh/a",{"$f":"Toimenpiteet!J38","v":{"v":0,"d":" 0"}},null,"MWh/a",null,{"$f":"+IF(B9<>0,D9/B9*100,\"\")","v":""},"%",{"v":0,"d":" 0"},null,"EUR",null,"Lämpö+polttoaineet lasketaan riveillä 28-46 annetuista tiedoista"]
[null,{"$f":"F32+F36+F38+F40+F44+F46","v":{"v":0,"d":" 0"}},"EUR/a",{"$f":"Toimenpiteet!N38+Toimenpiteet!P38","v":{"v":0,"d":" 0"}},null,"EUR/a",null,{"$f":"+IF(B10<>0,D10/B10*100,\"\")","v":""},"%",{"$nulls":4},"Jos kohteella on pelkää sähkölämmitystä jää Lämpö+polttoaineet kohta tyhjäksi"]
[{"$nulls":3},{"$f":"Toimenpiteet!L38","v":{"v":0,"d":" 0"}},null,"t CO2/a"]
[null,"Sähkö"]
[null,null,"MWh/a",{"$f":"Toimenpiteet!V38","v":{"v":0,"d":" 0"}},null,"MWh/a",null,{"$f":"+IF(B13<>0,D13/B13*100,\"\")","v":""},"%",{"v":0,"d":" 0"},null,"EUR",null,"Sähkön kokonaiskulutus ilmoitetaan tällä rivillä (solu B13)"]
[null,null,"EUR/a",{"$f":"Toimenpiteet!Z38+Toimenpiteet!AB38","v":{"v":0,"d":" 0"}},null,"EUR/a",null,{"$f":"+IF(B14<>0,D14/B14*100,\"\")","v":""},"%"]
[{"$nulls":3},{"$f":"Toimenpiteet!X38","v":{"v":0,"d":" 0"}},null,"t CO2/a",null,""]
[null,"Vedenkulutus"]
[null,null,"m3/a",{"$f":"Toimenpiteet!AD38","v":{"v":0,"d":" 0"}},null,"m3/a",null,{"$f":"+IF(B17<>0,D17/B17*100,\"\")","v":""},"%",{"v":0,"d":" 0"},null,"EUR"]
[null,null,"EUR/a",{"$f":"Toimenpiteet!AF38","v":{"v":0,"d":" 0"}},null,"EUR/a",null,{"$f":"+IF(B18<>0,D18/B18*100,\"\")","v":""},"%"]
[]
[null,"Kulutukset yhteensä",null,"Säästöt yhteensä",{"$nulls":5},"Investoinnit yhteensä"]
[]
[]
[null,{"$f":"B10+B14+B18","v":{"v":0,"d":" 0"}},"EUR/a",{"$f":"D10+D14+D18","v":{"v":0,"d":" 0"}},null,"EUR/a",null,{"$f":"+IF(B23<>0,D23/B23*100,\"\")","v":""},"%",{"$f":"Toimenpiteet!F38","v":{"v":0,"d":" 0"}},null,"EUR"]
[{"$nulls":3},{"$f":"D11+D15","v":{"v":0,"d":" 0"}},null,"t CO2/a",null,""]
[]
[]
[]
[null,"Lämmön + polttoaineiden kulutus energianlähteittäin",{"$nulls":5},"Sähkölämmityksen \nosuus sähköenergiasta"]
[{"$nulls":3},"Kulutus",null,"Kustannukset",{"$nulls":3},"Kulutus",null,"Kustannukset"]
[{"$nulls":3},"MWh",null,"€/a",{"$nulls":3},"MWh",null,"€/a"]
{"$rows_left_out":25}
{"sheet":"Toimenpiteet","index":2,"n_rows":38,"n_cols":37,"rows_kept":38,"merged":[[3,31,3,33],[5,9,5,15],[5,17,5,20],[5,21,5,27],[5,29,5,31],[5,34,9,34],[5,35,9,35],[6,9,6,15],[6,21,6,27],[6,29,6,31],[7,13,7,15],[7,25,7,27]]}
[null,{"$f":"Energia!A1","v":"Päätaulu Täsmäkatselmus"},null,"Taulukko 2",{"$nulls":30},"tämä sarake piilotetaan lopullisessa, mutta tämä on siis tieto joka viedään kantaan"]
[]
[]
[null,{"$f":"CONCATENATE(Kohdetiedot!E3,\"/\",Kohdetiedot!G3,\"/\",Kohdetiedot!I3)","v":"/31/"},{"$nulls":29},{"$f":"Kohdetiedot!C6","v":"00:00:00"}]
[null,{"$f":"Kohdetiedot!C11","v":0}]
[null,null,"TOIMENPITEEN","SÄÄSTÖ","TMA","INVES-",null,"CO2",null,"SÄÄSTÖ",{"$nulls":11},"SÄÄSTÖ",{"$nulls":7},"SÄÄSTÖ",{"$nulls":3},"SÄÄSTÖN","Toimenpide-koodi","TOIMENPITEEN LUOKITTELU","SOVITUT"]
[null,null,"KUVAUS","YHTEENSÄ",null,"TOINTI",null,"VÄHENEMÄ",null,"LÄMPÖ",{"$nulls":11},"SÄHKÖ",{"$nulls":7},"VESI",{"$nulls":3},"ELINIKÄ",null,null,"JATKO-"]
[{"$nulls":7},"YHTEENSÄ",null,"energia",null,"CO2",null,"kustannukset",{"$nulls":7},"energia",null,"CO2",null,"kustannukset",{"$nulls":3},"vesi",null,"kustan-",null,"arvio",null,null,"TOIMET"]
[{"$nulls":13},"energia",null,"muut",{"$nulls":9},"energia",null,"muut",{"$nulls":3},"nukset"]
[null,"no"," ","EUR/a","a","EUR",null,"t/a",null,"MWh/a",null,"t/a",null,"EUR/a",null,"EUR/a",{"$nulls":5},"MWh/a",null,"t/a",null,"EUR/a",null,"EUR/a",null,"m3/a",null,"EUR/a",null,"a",null,null," T,P,H,E"]
[null,1,null,{"$f":"N11+P11+Z11+AB11+AF11","v":0},{"$f":"IF(F11>0,F11/D11,0)","v":{"v":0,"d":"0.0"}},null,null,{"$f":"L11+X11","v":0},{"$nulls":26},{"$f":"IF(ISBLANK(AJ11),\"\",VLOOKUP(AJ11,Luokitukset!$Q$12:$R$53,2,FALSE))","v":""}]
[null,2,null,{"$f":"N12+P12+Z12+AB12+AF12","v":0},{"$f":"IF(F12>0,F12/D12,0)","v":{"v":0,"d":"0.0"}},null,null,{"$f":"L12+X12","v":0},{"$nulls":26},{"$f":"IF(ISBLANK(AJ12),\"\",VLOOKUP(AJ12,Luokitukset!$Q$12:$R$53,2,FALSE))","v":""}]
[null,3,null,{"$f":"N13+P13+Z13+AB13+AF13","v":0},{"$f":"IF(F13>0,F13/D13,0)","v":{"v":0,"d":"0.0"}},null,null,{"$f":"L13+X13","v":0},{"$nulls":26},{"$f":"IF(ISBLANK(AJ13),\"\",VLOOKUP(AJ13,Luokitukset!$Q$12:$R$53,2,FALSE))","v":""}]
[null,4,null,{"$f":"N14+P14+Z14+AB14+AF14","v":0},{"$f":"IF(F14>0,F14/D14,0)","v":{"v":0,"d":"0.0"}},null,null,{"$f":"L14+X14","v":0},{"$nulls":26},{"$f":"IF(ISBLANK(AJ14),\"\",VLOOKUP(AJ14,Luokitukset!$Q$12:$R$53,2,FALSE))","v":""}]
[null,5,null,0,{"v":0,"d":"0.0"},null,null,0,{"$nulls":26},{"$f":"IF(ISBLANK(AJ15),\"\",VLOOKUP(AJ15,Luokitukset!$Q$12:$R$53,2,FALSE))","v":""}]
[null,6,null,0,{"v":0,"d":"0.0"},null,null,0,{"$nulls":26},{"$f":"IF(ISBLANK(AJ16),\"\",VLOOKUP(AJ16,Luokitukset!$Q$12:$R$53,2,FALSE))","v":""}]
[null,7,null,0,{"v":0,"d":"0.0"},null,null,0,{"$nulls":26},{"$f":"IF(ISBLANK(AJ17),\"\",VLOOKUP(AJ17,Luokitukset!$Q$12:$R$53,2,FALSE))","v":""}]
[null,8,null,0,{"v":0,"d":"0.0"},null,null,0,{"$nulls":26},{"$f":"IF(ISBLANK(AJ18),\"\",VLOOKUP(AJ18,Luokitukset!$Q$12:$R$53,2,FALSE))","v":""}]
[null,9,null,0,{"v":0,"d":"0.0"},null,null,0,{"$nulls":26},{"$f":"IF(ISBLANK(AJ19),\"\",VLOOKUP(AJ19,Luokitukset!$Q$12:$R$53,2,FALSE))","v":""}]
[null,10,null,0,{"v":0,"d":"0.0"},null,null,0,{"$nulls":26},{"$f":"IF(ISBLANK(AJ20),\"\",VLOOKUP(AJ20,Luokitukset!$Q$12:$R$53,2,FALSE))","v":""}]
[null,11,null,0,{"v":0,"d":"0.0"},null,null,0,{"$nulls":26},{"$f":"IF(ISBLANK(AJ21),\"\",VLOOKUP(AJ21,Luokitukset!$Q$12:$R$53,2,FALSE))","v":""}]
[null,12,null,0,{"v":0,"d":"0.0"},null,null,0,{"$nulls":26},{"$f":"IF(ISBLANK(AJ22),\"\",VLOOKUP(AJ22,Luokitukset!$Q$12:$R$53,2,FALSE))","v":""}]
[null,13,null,0,{"v":0,"d":"0.0"},null,null,0,{"$nulls":26},{"$f":"IF(ISBLANK(AJ23),\"\",VLOOKUP(AJ23,Luokitukset!$Q$12:$R$53,2,FALSE))","v":""}]
[null,14,null,0,{"v":0,"d":"0.0"},null,null,0,{"$nulls":26},{"$f":"IF(ISBLANK(AJ24),\"\",VLOOKUP(AJ24,Luokitukset!$Q$12:$R$53,2,FALSE))","v":""}]
[null,15,null,0,{"v":0,"d":"0.0"},null,null,0,{"$nulls":26},{"$f":"IF(ISBLANK(AJ25),\"\",VLOOKUP(AJ25,Luokitukset!$Q$12:$R$53,2,FALSE))","v":""}]
[null,16,null,0,{"v":0,"d":"0.0"},null,null,0,{"$nulls":26},{"$f":"IF(ISBLANK(AJ26),\"\",VLOOKUP(AJ26,Luokitukset!$Q$12:$R$53,2,FALSE))","v":""}]
[null,17,null,0,{"v":0,"d":"0.0"},null,null,0,{"$nulls":26},{"$f":"IF(ISBLANK(AJ27),\"\",VLOOKUP(AJ27,Luokitukset!$Q$12:$R$53,2,FALSE))","v":""}]
[null,18,null,0,{"v":0,"d":"0.0"},null,null,0,{"$nulls":26},{"$f":"IF(ISBLANK(AJ28),\"\",VLOOKUP(AJ28,Luokitukset!$Q$12:$R$53,2,FALSE))","v":""}]
[null,19,null,0,{"v":0,"d":"0.0"},null,null,0,{"$nulls":26},{"$f":"IF(ISBLANK(AJ29),\"\",VLOOKUP(AJ29,Luokitukset!$Q$12:$R$53,2,FALSE))","v":""}]
[null,20,null,0,{"v":0,"d":"0.0"},null,null,0,{"$nulls":26},{"$f":"IF(ISBLANK(AJ30),\"\",VLOOKUP(AJ30,Luokitukset!$Q$12:$R$53,2,FALSE))","v":""}]
{"$rows_left_out":9}
{"sheet":"Tarkastuslista","index":3,"n_rows":50,"n_cols":5,"rows_kept":50,"merged":[[4,1,4,3]]}
[{"$f":"CONCATENATE(Energia!A1,\"      \",B3)","v":"Päätaulu Täsmäkatselmus      Tarkastuslista"},null,null,{"$f":"CONCATENATE(\"diaari \",Kohdetiedot!E3,\"/\",Kohdetiedot!G3,\"/\",Kohdetiedot!I3)","v":"diaari /31/"},"Tämä sarake piilotetaan lopullisesta"]
[]
[null,"Tarkastuslista"]
[]
[null,"Täytä C-sarakkeeseen K tai E, sen mukaan löytyykö kyseinen järjestelmä/kohde. Mikäli järjestelmä/kohde löytyy (C-sarakkeen arvo K) täytä sarakkeeseen D tieto onko kyseinen järjestelmä/kohde tarkasteltu katselmuksessa."]
[]
[null,"Järjestelmä tai kohde","Löytyy kohteesta (K=kyllä tai E=ei)","Tarkasteltu katselmuksessa (K=kokonaisuudessaan, O=osittain tai E=ei lainkaan)"]
[null,"Lämmitysjärjestelmä",null,null,100]
[null,"Lämmöntuotto",null,null,101]
[null,"Lämmönjako",null,null,102]
[null,"Lämmitysverkoston säätö- ja asetusarvot",null,null,103]
[null,"Sisälämpötilatasot",null,null,104]
[null,"Ilmanvaihtojärjestelmä",null,null,200]
[null,"Ilmanvaihdon asetusarvot",null,null,201]
[null,"Lämmöntalteenotto",null,null,202]
[null,"Tarpeenmukainen ilmanvaihto",null,null,203]
[null,"Käyttövesijärjestelmä",null,null,300]
[null,"Vedensäästötoimenpiteet",null,null,301]
[null,"Jäähdytysjärjestelmä",null,null,400]
[null,"Jäähdytyksen asetusarvot",null,null,401]
[null,"Jäähdytyksen parannustoimet",null,null,402]
[null,"Paineilmajärjestelmä",null,null,500]
[null,"Hukkalämmön hyödyntäminen",null,null,501]
[null,"Paineilman tuotanto",null,null,502]
[null,"Paineilmavuodot",null,null,503]
[null,"Höyry- ja lauhde järjestelmä",null,null,600]
[null,"Rakenteet",null,null,700]
[null,"Aurinkosähköjärjestelmä",null,null,800]
[null,"Aurinkosähkön lisäämisen potentiaali",null,null,801]
[null,"Muu uusiutuva energia",null,null,900]
{"$rows_left_out":21}
{"sheet":"Ohjeita","index":4,"n_rows":42,"n_cols":3,"rows_kept":42}
[{"$f":"Energia!A1","v":"Päätaulu Täsmäkatselmus"},null,"Ohjesivu"]
["2021-08-13"]
[null,"Yleisiä ohjeita energiakatselmuksen päätaulun toimittamiseen"]
[null,null,"Muista tarkistaa, että käytössäsi on viimeisin versio päätaulusta. Viimeisimmän lomakkeen löydät Energiakatselmoijien extranetistä alla olevan linkin kautta:"]
[null,null,"https://www.motiva.fi/extranet/energiakatselmoijat/raporttien_ja_paataulujen_siirto_motivaan"]
[null,null,"Tämän siirtotiedoston tiedot siirretään ohjelmallisesti katselmusten seurantajärjestelmään. Tiedoston rakennetta (esim. välilehtien määrää) tai tietojen sijoittelua välilehdillä ei saa muuttaa."]
[null,null,"Täytä päätauluun kaikki tarvittavat tiedot. Puutteellisesti täytetystä päätaulusta lähetetään toimittajalle täydennyspyyntö viimeistään katselmusten laadunvarmistuksen yhteydessä."]
[null,"Päätaulun palautus"]
[null,null,"Päätaulu ja katselmusraportti toimitetaan Motivaan sähköisesti Motivan extranetsivujen kautta (Päätaulujen siirtopalvelu)"]
[null,null,"www.motiva.fi/extranet"]
[null,null,"Palvelun käyttö edellyttää, että katselmoijalla on käyttäjätunnukset Motivan energiakatselmoijien extranetpalveluun. Käyttäjätunnukset lähetetään energiakatselmusten peruskurssin ja siihen liittyvän tentin hyväksytysti suorittaneille katselmoijille. Jos sinulla ei vielä ole käyttäjätunnuksia, lähetä tunnuspyyntö osoitteeseen katselmoijaposti@motiva.fi"]
[null,null,"Tiedostot siirretään katselmustukipäätöksessä olevan hankkeen diaarinumeron perusteella, joka on oltava tiedossa ennen siirtoa. Mikäli diaaria ei löydy siirtopalvelusta tai siirrossa on muita ongelmia, ottakaa yhteyttä Ritva Isohellaan, ritva.isohella@motiva.fi."]
[null,null,"Energiakatselmustukea katselmukselle ei voida maksaa ennen kuin katselmusraportit ja päätaulu-tiedostot on toimitettu!"]
[null,"Kohdetiedot välilehti"]
[null,null,"Hankkeen diaarinumero täytetää Business Finlandin tukipäätöksen mukaisesti"]
[null,null,"Raportin päiväys täytetään viimeisimmän asiakkaan hyväksymän version mukaisesti"]
[null,null,"Toimiala (TOL2008) ja rakennustyyppi (Rakennustyyppiluokitus 2018) valitaan valintalistoista. Luokitukset noudattavat Tilastokeskuksen luokituksia"]
[null,null,"Pinta-alaksi syötetään kohteen lämmitetty kerrosala"]
[null,null,"Mikäli yritys on liittynyt energiatehokkuussopimukseen, katselmus linkitetään näkyviin energiatehokkuussopimusten seurantajärjestelmään. Tällöin linkitettyjen energiakatselmusten toimenpide-ehdotukset tulevat automaattisesti näkyviin energiatehokkuussopimusten vuosiraportille. Täytä vähintään Sopimuksen toimiala, Liittyjän nimi ja Toimipaikan nimi vuosiraportoinnissa.\nLinkitykseen tarvittavat tiedot saadaan energiatehokkuussopimusten seurantajärjestelmästä (esim. vuosiraportin ensimmäiseltä sivulta)."]
[null,"Energia välilehti (taulukko 1.)"]
[null,null,"Energia-välilehdellä tiedot täydennetään vihreällä merkittyihin soluihin. Lämmön ja polttoaineiden tiedot (solut B15 ja B16) lasketaan Energia-välilehdellä syötetyistä muista tiedoista"]
[null,null,"Ilmoita taulukon otsikko-osan solussa (B13) energiatietojen vuosi neljällä numerolla. Oletuksena solussa näkyy energiatietojen vuotena kohdekatselmusraportin päiväystä edeltävä vuosi (tieto linkittyy Perustiedot-välilehdeltä). Tarkista ja korjaa tieto tarvittaessa"]
[null,null,"Lämmityksen energiankulutus raportoidaan aina normitettuna ja normituspaikkakunta ilmoitetaan sivun alaosassa. \nLisätietoja normituksesta"]
[null,null,"www.motiva.fi/kulutuksennormitus"]
[null,null,"Säästöpotentiaaleja koskevat tiedot (MWh/a ja €/a) linkittyvät Energia-välilehdelle automaattisesti Toimenpiteet-välilehdeltä."]
[null,"Toimenpiteet välilehti (taulukko 2.)"]
[null,null,"”Toimenpiteen kuvaus” -kentästä tulee selkeästi käydä ilmi säästötoimenpide eli mitä on tehty."]
[null,null,"Sarakkeen ”Säästö yhteensä” (€/a) tieto lasketaan automaattisesti yhteen sarakkeissa ”Lämpö”, ”Sähkö” ja ”Vesi” raportoiduista kustannussäästöistä (€/a)"]
[null,null,"Takaisinmaksuaika (”TMA”) lasketaan sarakkeiden ”Investointi” ja ”Kustannussäästö yhteensä” tiedoista (Investointi/Kustannussäästö yhteensä)."]
[null,null,"Sarakkeen ”CO2 vähenemä yhteensä” (t/a) tieto lasketaan automaattisesti yhteen sarakkeissa ”Lämpö”, ”Sähkö” ja ”Vesi” raportoiduista CO2 vähenemistä (t/a)"]
{"$rows_left_out":13}
{"sheet":"Luokitukset","index":5,"n_rows":371,"n_cols":27,"rows_kept":371}
[{"$f":"Kohdetiedot!A1","v":"Päätaulu Täsmäkatselmus"}]
[{"$f":"Kohdetiedot!B2","v":"2021-08-13"}]
[]
[{"$nulls":5},"tämä sarake piilotetaan","tämä sarake piilotetaan",{"$nulls":3},"tämä sarake piilotetaan","tämä sarake piilotetaan",{"$nulls":4},"tämä sarake piilotetaan",{"$nulls":4},"tämä sarake piilotetaan"]
[null,null,"Tältä välilehdeltä haetaan vaihtoehdot Kohdetiedot ja Toimenpiteet -välilehtien Rakennustyyppi, Toimialaluokka, Toimenpideohjelma ja Toimenpiteiden luokittelu kohtiin."]
[]
[]
[null,null,"Rakennustyyppi",null,null,"Rakennustyyppi",null,null,"Toimiala",null,"Toimiala",{"$nulls":3},"Säästötoimenpiteiden luokittelu",{"$nulls":4},"Toimenpideohjelma/Sopimus",{"$nulls":4},"Tarkastuslistan vaihtoehdot"]
[null,null,"Perustuu Tilastokeskuksen luokitukseen vuodelta 2018",null,null,"Perustuu Tilastokeskuksen luokitukseen vuodelta 2018",null,null,"Tilastokeskuksen toimialaluokitus TOL2008",null,"Tilastokeskuksen toimialaluokitus TOL2008",null,null,"Ohje toimenpiteiden luokitteluun löytyy energiakatselmoijien Extranetistä alla linkki"]
[{"$nulls":14},"Toimenpiteiden luokitteluohje"]
[null,"Koodi","Rakennustyypin nimi","Koodi",null,"Rakennustyypin nimi","Koodi",null,"Toimiala (TOL2008)","TOL koodi","Toimiala","TOL koodi",null,"Koodi","Toimenpideluokka",null,"Toimenpideluokka","Koodi",null,"Toimenpideohjelma/Sopimus",null,"Toimenpideohjelma",null,"Toteutusvaihe","Löytyy kohteesta",null,"Tarkasteltu katselmuksessa"]
[null,"01",{"$f":"F12","v":"Asuinrakennukset"},{"$f":"G12","v":"01"},null,"Asuinrakennukset","01",null,{"$f":"K12","v":"00 Toimiala tuntematon"},{"$f":"L12","v":"00"},"00 Toimiala tuntematon","00",null,"4.1","Lämmitysjärjestelmä",null,"4.1 Lämmitysjärjestelmä","4.1",null,"Elinkeinoelämän toimenpideohjelmant",null,"Elinkeinoelämä - Elintarviketeollisuus",null,"T","K",null,"K"]
[null,"011",{"$f":"F13","v":"Pientalot"},"011",null,"Pientalot","011",null,{"$f":"K13","v":"01 Kasvinviljely ja kotieläintalous, riistatalous ja niihin liittyvät palvelut"},"01","01 Kasvinviljely ja kotieläintalous, riistatalous ja niihin liittyvät palvelut","01",null,"4.1.1","Lämmöntuotto",null,"4.1.1 Lämmöntuotto","4.1.1",null,"Teollisuus",null,"Elinkeinoelämä - Kemianteollisuus",null,"P","E",null,"O"]
[null,"012","Kerrostalot","012",null,"Kerrostalot","012",null,"011 Yksivuotisten kasvien viljely","011","011 Yksivuotisten kasvien viljely","011",null,"4.1.2","Lämmitysverkosto ja sisälämpötilan alentaminen ",null,"4.1.2 Lämmitysverkosto ja sisälämpötilan alentaminen ","4.1.2",null," Elintarviketeollisuus",null,"Elinkeinoelämä - Muoviteollisuus",null,"H",null,null,"E"]
[null,"013","Asuntolarakennukset","013",null,"Asuntolarakennukset","013",null,"012 Monivuotisten kasvien viljely","012","012 Monivuotisten kasvien viljely","012",null,"4.1.3","Säädön parantaminen",null,"4.1.3 Säädön parantaminen","4.1.3",null," Kemianteollisuus",null,"Elinkeinoelämä - Puutuoteteollisuus",null,"E"]
[null,"014","Erityisryhmien asuinrakennukset","014",null,"Erityisryhmien asuinrakennukset","014",null,"013 Taimien kasvatus ja muu kasvien lisääminen","013","013 Taimien kasvatus ja muu kasvien lisääminen","013",null,"4.1.5","Eristykset - putkieristykset, säiliöeristykset",null,"4.1.5 Eristykset - putkieristykset, säiliöeristykset","4.1.5",null," Muoviteollisuus",null,"Elinkeinoelämä - Teknologiateollisuus"]
[null,"02","Vapaa-ajan asuinrakennukset","02",null,"Vapaa-ajan asuinrakennukset","02",null,"014 Kotieläintalous","014","014 Kotieläintalous","014",null,"4.2","Ilmanvaihtojärjestelmä",null,"4.2 Ilmanvaihtojärjestelmä","4.2",null," Puutuoteteollisuus",null,"Elinkeinoelämä - Teollisuuden yleinen"]
[null,"03","Liikerakennukset","03",null,"Liikerakennukset","03",null,"015 Yhdistetty kasvinviljely ja kotieläintalous (sekatilat)","015","015 Yhdistetty kasvinviljely ja kotieläintalous (sekatilat)","015",null,"4.2.1","Ilmanvaihdon käyntiajat",null,"4.2.1 Ilmanvaihdon käyntiajat","4.2.1",null," Teknologiateollisuus",null,"Elinkeinoelämä - Energiavaltainen teollisuus"]
[null,"031","Myymälärakennukset","031",null,"Myymälärakennukset","031",null,"016 Maataloutta palveleva toiminta","016","016 Maataloutta palveleva toiminta","016",null,"4.2.2","Ilmavirran säätäminen",null,"4.2.2 Ilmavirran säätäminen","4.2.2",null," Teollisuuden yleinen",null,"Elinkeinoelämä - Kauppa"]
[null,"0310","Tukku- ja vähittäiskaupan myymälähallit","0310",null,"Tukku- ja vähittäiskaupan myymälähallit","0310",null,"017 Metsästys ja sitä palveleva toiminta","017","017 Metsästys ja sitä palveleva toiminta","017",null,"4.2.3","Ilmanvaihdon palvelualueiden osittaminen",null,"4.2.3 Ilmanvaihdon palvelualueiden osittaminen","4.2.3",null," Energiavaltainen teollisuus",null,"Elinkeinoelämä - MaRa"]
[null,"0311","Kauppakeskukset ja liike- ja tavaratalot","0311",null,"Kauppakeskukset ja liike- ja tavaratalot","0311",null,"02 Metsätalous ja puunkorjuu","02","02 Metsätalous ja puunkorjuu","02",null,"4.2.4","Ilmanvaihdon lämmityksen säätötavat",null,"4.2.4 Ilmanvaihdon lämmityksen säätötavat","4.2.4",null,"Palvelu",null,"Elinkeinoelämä - Auto"]
[null,"0319","Muut myymälärakennukset","0319",null,"Muut myymälärakennukset","0319",null,"021 Metsänhoito","021","021 Metsänhoito","021",null,"4.2.5","Lämmöntalteenotto",null,"4.2.5 Lämmöntalteenotto","4.2.5",null," Kauppa",null,"Elinkeinoelämä - Palvelun yleinen"]
[null,"032","Majoitusliikerakennukset","032",null,"Majoitusliikerakennukset","032",null,"022 Puunkorjuu","022","022 Puunkorjuu","022",null,"4.2.7","Puhallin tai järjestelmäuusinta",null,"4.2.7 Puhallin tai järjestelmäuusinta","4.2.7",null," MaRa",null,"Elinkeinoelämä - Energiapalvelut"]
[null,"0320","Hotellit","0320",null,"Hotellit","0320",null,"023 Luonnon tuotteiden keruu (pl. polttopuu)","023","023 Luonnon tuotteiden keruu (pl. polttopuu)","023",null,"4.3","Käyttövesijärjestelmä",null,"4.3 Käyttövesijärjestelmä","4.3",null," Auto",null,"Elinkeinoelämä - Energiantuotanto"]
[null,"0321","Motellit, hostellit ja vastaavat majoitusliikerakennukset","0321",null,"Motellit, hostellit ja vastaavat majoitusliikerakennukset","0321",null,"024 Metsätaloutta palveleva toiminta","024","024 Metsätaloutta palveleva toiminta","024",null,"4.3.1","Vesikalusteiden virtaaman rajoitus",null,"4.3.1 Vesikalusteiden virtaaman rajoitus","4.3.1",null," Palvelun yleinen",null,"Kiinteistöala - TETS"]
[null,"0322","Loma-, lepo- ja virkistyskodit","0322",null,"Loma-, lepo- ja virkistyskodit","0322",null,"03 Kalastus ja vesiviljely","03","03 Kalastus ja vesiviljely","03",null,"4.3.2","Vesikalusteiden vaihto",null,"4.3.2 Vesikalusteiden vaihto","4.3.2",null,"Energia-ala",null,"Kiinteistöala - VAETS"]
[null,"0329","Muut majoitusliikerakennukset","0329",null,"Muut majoitusliikerakennukset","0329",null,"031 Kalastus","031","031 Kalastus","031",null,"4.3.3","Käyttöveden lämpötilan alentaminen",null,"4.3.3 Käyttöveden lämpötilan alentaminen","4.3.3",null," Energiapalvelut",null,"Kunnat - KETS"]
[null,"033","Ravintolarakennukset ja vastaavat liikerakennukset","033",null,"Ravintolarakennukset ja vastaavat liikerakennukset","033",null,"032 Vesiviljely","032","032 Vesiviljely","032",null,"4.4","Sähkö",null,"4.4 Sähkö","4.4",null," Energiantuotanto",null,"Kunnat - KEO"]
[null,"04","Toimistorakennukset","04",null,"Toimistorakennukset","04",null,"05 Kivihiilen ja ruskohiilen kaivu","05","05 Kivihiilen ja ruskohiilen kaivu","05",null,"4.4.1","Tariffin ja jännitetason tarkistus ja loistehon kompensointi",null,"4.4.1 Tariffin ja jännitetason tark. ja loistehon kompensointi","4.4.1",null,"Kiinteistöalan toimenpideohjelmat"]
[null,"040","Toimistorakennukset","040",null,"Toimistorakennukset","040",null,"051 Kivihiilen kaivu","051","051 Kivihiilen kaivu","051",null,"4.4.2","Kuormitushuippujen tasaus ja kulutuksen ajoitus",null,"4.4.2 Kuormitushuippujen tasaus/kulutuksen ajoitus","4.4.2",null," Toimitilakiinteistöt (TETS)"]
{"$rows_left_out":341}